[riscv-reports] [#127333] sisyphus_riscv64 FAILED srpm=crush-0.74.1-alt1.src.rpm
Girar sisyphus_riscv64 awaiter recycler
noreply at basealt.ru
Sun May 31 04:46:03 MSK 2026
http://web.build.srt.basealt.ru/tasks/127333/logs/events.1.1.log
subtask name riscv64
#100 crush failed
2026-May-31 01:34:02 :: shared task #127333 for sisyphus_riscv64 started by recycler:
2026-May-31 01:34:02 :: message: sync
#100 build crush-0.74.1-alt1.src.rpm
2026-May-31 01:34:09 :: [riscv64] #100 crush-0.74.1-alt1.src.rpm: build start
[riscv64] ok github.com/charmbracelet/crush/internal/cmd 2.485s
[riscv64] --- FAIL: TestClientServerSpawnRace (111.74s)
[riscv64] race_test.go:227: no /v1/health probe succeeded on /tmp/crush-race-2847900647/crush.sock while 8 clients were running
2026-May-31 01:46:02 :: [riscv64] crush-0.74.1-alt1.src.rpm: remote: build failed
2026-May-31 01:46:02 :: [riscv64] #100 crush-0.74.1-alt1.src.rpm: build FAILED
2026-May-31 01:46:02 :: [riscv64] requesting cancellation of task processing
2026-May-31 01:46:03 :: [riscv64] build FAILED
2026-May-31 01:46:03 :: task #127333 for sisyphus_riscv64 FAILED
More information about the Riscv-reports
mailing list