[riscv-reports] [#127146] sisyphus_riscv64 FAILED (try 2) srpm=python3-module-strawberry-graphql-0.316.0-alt1.src.rpm ...

Girar sisyphus_riscv64 awaiter recycler noreply at basealt.ru
Thu May 28 23:22:40 MSK 2026


http://web.build.srt.basealt.ru/tasks/127146/logs/events.2.1.log

subtask  name                       riscv64
   #500  python3-module-netbox-sdk   failed

2026-May-28 20:15:50 :: shared task #127146 for sisyphus_riscv64 resumed by recycler:
2026-May-28 20:15:50 :: message: sync
#100 build python3-module-strawberry-graphql-0.316.0-alt1.src.rpm
#200 build python3-module-zensical-0.0.43-alt1.src.rpm
#300 build netbox-4.6.1-alt1.src.rpm
#400 build netbox-floorplan-0.9.2-alt1.src.rpm
#500 build python3-module-netbox-sdk-0.0.9-alt1.src.rpm
#600 build python3-module-proxmox-sdk-0.0.9-alt1.src.rpm
#700 build proxbox-api-0.0.15-alt1.src.rpm
#1000 build netbox-proxbox-0.0.18-alt1.src.rpm
2026-May-28 20:15:51 :: created build repo
2026-May-28 20:16:10 :: [riscv64] #100 python3-module-strawberry-graphql-0.316.0-alt1.src.rpm: build start
2026-May-28 20:16:12 :: [riscv64] #100 python3-module-strawberry-graphql-0.316.0-alt1.src.rpm: build swiftly SKIPPED
2026-May-28 20:16:12 :: [riscv64] #200 python3-module-zensical-0.0.43-alt1.src.rpm: build start
2026-May-28 20:16:15 :: [riscv64] #200 python3-module-zensical-0.0.43-alt1.src.rpm: build swiftly SKIPPED
2026-May-28 20:16:15 :: [riscv64] #300 netbox-4.6.1-alt1.src.rpm: build start
2026-May-28 20:16:19 :: [riscv64] #300 netbox-4.6.1-alt1.src.rpm: build swiftly SKIPPED
2026-May-28 20:16:19 :: [riscv64] #400 netbox-floorplan-0.9.2-alt1.src.rpm: build start
2026-May-28 20:16:22 :: [riscv64] #400 netbox-floorplan-0.9.2-alt1.src.rpm: build swiftly SKIPPED
2026-May-28 20:16:22 :: [riscv64] #500 python3-module-netbox-sdk-0.0.9-alt1.src.rpm: build start
[riscv64] =========================== short test summary info ============================
[riscv64] FAILED tests/test_typed_sdk.py::test_typed_api_selects_versioned_client - Fai...
[riscv64] ============= 1 failed, 757 passed, 2 skipped in 156.86s (0:02:36) =============
[riscv64] INFO     : Command's result: FAILURE
[riscv64] INFO     : Command's error: Command '['python3', '-m', 'pytest']' returned non-zero exit status 1.
2026-May-28 20:22:39 :: [riscv64] python3-module-netbox-sdk-0.0.9-alt1.src.rpm: remote: build failed
2026-May-28 20:22:39 :: [riscv64] #500 python3-module-netbox-sdk-0.0.9-alt1.src.rpm: build FAILED
2026-May-28 20:22:39 :: [riscv64] requesting cancellation of task processing
2026-May-28 20:22:40 :: [riscv64] build FAILED
2026-May-28 20:22:40 :: task #127146 for sisyphus_riscv64 FAILED


More information about the Riscv-reports mailing list