[riscv-reports] [#127053] sisyphus_riscv64 FAILED srpm=crush-0.73.0-alt1.src.rpm

Girar sisyphus_riscv64 awaiter recycler noreply at basealt.ru
Thu May 28 05:29:00 MSK 2026


http://web.build.srt.basealt.ru/tasks/127053/logs/events.1.1.log

subtask  name   riscv64
   #100  crush   failed

2026-May-28 02:17:05 :: shared task #127053 for sisyphus_riscv64 started by recycler:
2026-May-28 02:17:05 :: message: sync
#100 build crush-0.73.0-alt1.src.rpm
2026-May-28 02:17:11 :: [riscv64] #100 crush-0.73.0-alt1.src.rpm: build start
[riscv64] ok  	github.com/charmbracelet/crush/internal/cmd	2.381s
[riscv64] --- FAIL: TestClientServerSpawnRace (112.45s)
[riscv64]     race_test.go:227: no /v1/health probe succeeded on /tmp/crush-race-1277618992/crush.sock while 8 clients were running
2026-May-28 02:28:59 :: [riscv64] crush-0.73.0-alt1.src.rpm: remote: build failed
2026-May-28 02:28:59 :: [riscv64] #100 crush-0.73.0-alt1.src.rpm: build FAILED
2026-May-28 02:28:59 :: [riscv64] requesting cancellation of task processing
2026-May-28 02:29:00 :: [riscv64] build FAILED
2026-May-28 02:29:00 :: task #127053 for sisyphus_riscv64 FAILED


More information about the Riscv-reports mailing list