[riscv-reports] [#126945] sisyphus_riscv64 FAILED srpm=envision-3.2.0-alt1.src.rpm
Girar sisyphus_riscv64 awaiter recycler
noreply at basealt.ru
Wed May 27 17:04:27 MSK 2026
http://web.build.srt.basealt.ru/tasks/126945/logs/events.1.1.log
2026-May-27 14:03:15 :: shared task #126945 for sisyphus_riscv64 started by recycler:
2026-May-27 14:03:15 :: message: sync
#100 build envision-3.2.0-alt1.src.rpm
2026-May-27 14:03:20 :: [riscv64] #100 envision-3.2.0-alt1.src.rpm: build start
2026-May-27 14:04:27 :: [riscv64] #100 envision-3.2.0-alt1.src.rpm: build SKIPPED
2026-May-27 14:04:27 :: #100: envision-3.2.0-alt1.src.rpm: no source package
2026-May-27 14:04:27 :: build check FAILED for: #100
2026-May-27 14:04:27 :: task #126945 for sisyphus_riscv64 FAILED
More information about the Riscv-reports
mailing list