[riscv-reports] [#126855] sisyphus_riscv64 FAILED srpm=OpenComposite-1.0.1521-alt1.src.rpm
Girar sisyphus_riscv64 awaiter recycler
noreply at basealt.ru
Tue May 26 20:45:49 MSK 2026
http://web.build.srt.basealt.ru/tasks/126855/logs/events.1.1.log
2026-May-26 17:44:34 :: shared task #126855 for sisyphus_riscv64 started by recycler:
2026-May-26 17:44:34 :: message: sync
#100 build OpenComposite-1.0.1521-alt1.src.rpm
2026-May-26 17:44:47 :: [riscv64] #100 OpenComposite-1.0.1521-alt1.src.rpm: build start
2026-May-26 17:45:49 :: [riscv64] #100 OpenComposite-1.0.1521-alt1.src.rpm: build SKIPPED
2026-May-26 17:45:49 :: #100: OpenComposite-1.0.1521-alt1.src.rpm: no source package
2026-May-26 17:45:49 :: build check FAILED for: #100
2026-May-26 17:45:49 :: task #126855 for sisyphus_riscv64 FAILED
More information about the Riscv-reports
mailing list