[riscv-reports] [#126383] sisyphus_riscv64 FAILED srpm=python3-module-xonsh-0.23.7-alt1.14.g2791ce61.src.rpm
Girar sisyphus_riscv64 awaiter recycler
noreply at basealt.ru
Thu May 21 21:22:46 MSK 2026
http://web.build.srt.basealt.ru/tasks/126383/logs/events.1.1.log
subtask name riscv64
#100 python3-module-xonsh failed
2026-May-21 17:38:25 :: shared task #126383 for sisyphus_riscv64 started by recycler:
2026-May-21 17:38:25 :: message: sync
#100 build python3-module-xonsh-0.23.7-alt1.14.g2791ce61.src.rpm
2026-May-21 17:38:32 :: [riscv64] #100 python3-module-xonsh-0.23.7-alt1.14.g2791ce61.src.rpm: build start
[riscv64] XPASS tests/xintegration/test_integrations.py::test_xonsh_no_close_fds
[riscv64] FAILED tests/xintegration/test_integrations.py::test_catching_exit_signal - subprocess.TimeoutExpired: Command '['/usr/src/RPM/BUILD/python3-module-xonsh-0.23.7/.run_venv/bin/python3', '-m', 'xonsh', '--no-rc', '-i']' timed out after 3 seconds
[riscv64] FAILED tests/xintegration/test_integrations.py::test_forwarding_sighup - subprocess.TimeoutExpired: Command '['/usr/src/RPM/BUILD/python3-module-xonsh-0.23.7/.run_venv/bin/python3', '-m', 'xonsh', '--no-rc', '-i']' timed out after 5 seconds
[riscv64] FAILED tests/xintegration/test_integrations.py::test_on_postcommand_waiting - subprocess.TimeoutExpired: Command '['/usr/src/RPM/BUILD/python3-module-xonsh-0.23.7/.run_venv/bin/python3', '-m', 'xonsh', '--no-rc', '-i']' timed out after 5 seconds
[riscv64] FAILED tests/xintegration/test_stress.py::test_callable_alias_fd_leaking[\n$XONSH_SHOW_TRACEBACK = True\nimport sys\n\n at aliases.register\ndef _a(args, stdin, stdout, stderr):\n name = 'a'\n\n print(f"{name}: print out alias.stdout", file=stdout)\n print(f"{name}: print err alias.stderr", file=stderr)\n\n print(f"{name}: print out sys.stdout", file=sys.stdout)\n print(f"{name}: print err sys.stderr", file=sys.stderr)\n\n echo @(f"{name}: echo stdout")\n echo @(f"{name}: echo stderr") o>e\n\n ![echo @(f"{name}: ![] echo stdout")]\n $[echo @(f"{name}: $[] echo stdout")]\n\n $(echo @(f"{name}: $() echo stdout LEAKING TEST"))\n $(echo @(f"{name}: $() echo stderr") o>e)\n\n !(echo @(f"{name}: !() echo stdout LEAKING TEST"))\n !(echo @(f"{name}: !() echo stderr LEAKING TEST") o>e)\n\n execx(f'echo "{name}: execx echo stdout"')\n execx(f'echo "{name}: execx echo stderr" o>e')\n\n echo 1 && echo 2\n\n\n at aliases.register\ndef _b(args, s
tdin, stdout, stderr):\n name = 'b'\n\n print(f"{name}: print out alias.stdout", file=stdout)\n print(f"{name}: print err alias.stderr", file=stderr)\n\n print(f"{name}: print out sys.stdout", file=sys.stdout)\n print(f"{name}: print err sys.stderr", file=sys.stderr)\n\n echo @(f"{name}: echo stdout")\n echo @(f"{name}: echo stderr") o>e\n\n ![echo @(f"{name}: ![] echo stdout")]\n $[echo @(f"{name}: $[] echo stdout")]\n\n $(echo @(f"{name}: $() echo stdout LEAKING TEST"))\n $(echo @(f"{name}: $() echo stderr") o>e)\n\n !(echo @(f"{name}: !() echo stdout LEAKING TEST"))\n !(echo @(f"{name}: !() echo stderr LEAKING TEST") o>e)\n\n execx(f'echo "{name}: execx echo stdout"')\n execx(f'echo "{name}: execx echo stderr" o>e')\n\n echo 3 && echo 4\n\nfor i in range(111):\n $(a | b)\n\n\n# Empirically, in case of a leak, the output\n# drops out at ~600-1000 function calls.\nfor i in range(10):\n for j in range(69):\n $(a | b)\n\n]
- subprocess.TimeoutExpired: Command '['/usr/src/RPM/BUILD/python3-module-xonsh-0.23.7/.run_venv/bin/python3', '-m', 'xonsh', '--no-rc', '-c', '\n$XONSH_SHOW_TRACEBACK = True\nimport sys\n\n at aliases.register\ndef _a(args, stdin, stdout, stderr):\n name = \'a\'\n\n print(f"{name}: print out alias.stdout", file=stdout)\n print(f"{name}: print err alias.stderr", file=stderr)\n\n print(f"{name}: print out sys.stdout", file=sys.stdout)\n print(f"{name}: print err sys.stderr", file=sys.stderr)\n\n echo @(f"{name}: echo stdout")\n echo @(f"{name}: echo stderr") o>e\n\n ![echo @(f"{name}: ![] echo stdout")]\n $[echo @(f"{name}: $[] echo stdout")]\n\n $(echo @(f"{name}: $() echo stdout LEAKING TEST"))\n $(echo @(f"{name}: $() echo stderr") o>e)\n\n !(echo @(f"{name}: !() echo stdout LEAKING TEST"))\n !(echo @(f"{name}: !() echo stderr LEAKING TEST") o>e)\n\n execx(f\'echo "{name}: execx echo stdout"\')\n execx(f\'echo "{name}: execx echo stderr" o
>e\')\n\n echo 1 && echo 2\n\n\n at aliases.register\ndef _b(args, stdin, stdout, stderr):\n name = \'b\'\n\n print(f"{name}: print out alias.stdout", file=stdout)\n print(f"{name}: print err alias.stderr", file=stderr)\n\n print(f"{name}: print out sys.stdout", file=sys.stdout)\n print(f"{name}: print err sys.stderr", file=sys.stderr)\n\n echo @(f"{name}: echo stdout")\n echo @(f"{name}: echo stderr") o>e\n\n ![echo @(f"{name}: ![] echo stdout")]\n $[echo @(f"{name}: $[] echo stdout")]\n\n $(echo @(f"{name}: $() echo stdout LEAKING TEST"))\n $(echo @(f"{name}: $() echo stderr") o>e)\n\n !(echo @(f"{name}: !() echo stdout LEAKING TEST"))\n !(echo @(f"{name}: !() echo stderr LEAKING TEST") o>e)\n\n execx(f\'echo "{name}: execx echo stdout"\')\n execx(f\'echo "{name}: execx echo stderr" o>e\')\n\n echo 3 && echo 4\n\nfor i in range(111):\n $(a | b)\n\n\n# Empirically, in case of a leak, the output\n# drops out at ~600-1000 function ca
lls.\nfor i in range(10):\n for j in range(69):\n $(a | b)\n\n']' timed out after 600 seconds
[riscv64] = 4 failed, 7247 passed, 48 skipped, 3 xfailed, 1 xpassed, 11 rerun in 2428.38s (0:40:28) =
[riscv64] INFO : Command's result: FAILURE
[riscv64] INFO : Command's error: Command '['python3', '-m', 'pytest', '-vvvra', '--timeout=240', '--reruns', '2']' returned non-zero exit status 1.
2026-May-21 18:22:45 :: [riscv64] python3-module-xonsh-0.23.7-alt1.14.g2791ce61.src.rpm: remote: build failed
2026-May-21 18:22:45 :: [riscv64] #100 python3-module-xonsh-0.23.7-alt1.14.g2791ce61.src.rpm: build FAILED
2026-May-21 18:22:45 :: [riscv64] requesting cancellation of task processing
2026-May-21 18:22:46 :: [riscv64] build FAILED
2026-May-21 18:22:46 :: task #126383 for sisyphus_riscv64 FAILED
More information about the Riscv-reports
mailing list