[riscv-reports] [#126372] sisyphus_riscv64 FAILED srpm=kafka-4.3.0-alt1.src.rpm

Girar sisyphus_riscv64 awaiter recycler noreply at basealt.ru
Thu May 21 20:30:52 MSK 2026


http://web.build.srt.basealt.ru/tasks/126372/logs/events.1.1.log

2026-May-21 17:29:00 :: shared task #126372 for sisyphus_riscv64 started by recycler:
2026-May-21 17:29:00 :: message: sync
#100 build kafka-4.3.0-alt1.src.rpm
2026-May-21 17:29:06 :: [riscv64] #100 kafka-4.3.0-alt1.src.rpm: build start
2026-May-21 17:30:50 :: [riscv64] #100 kafka-4.3.0-alt1.src.rpm: build SKIPPED
2026-May-21 17:30:52 :: #100: kafka-4.3.0-alt1.src.rpm: no source package
2026-May-21 17:30:52 :: build check FAILED for: #100 
2026-May-21 17:30:52 :: task #126372 for sisyphus_riscv64 FAILED


More information about the Riscv-reports mailing list