[riscv-reports] [#126331] sisyphus_riscv64 FAILED srpm=hd-idle-1.22-alt1.src.rpm
Girar sisyphus_riscv64 awaiter recycler
noreply at basealt.ru
Thu May 21 15:42:09 MSK 2026
http://web.build.srt.basealt.ru/tasks/126331/logs/events.1.1.log
subtask name riscv64
#100 hd-idle failed
2026-May-21 12:38:22 :: shared task #126331 for sisyphus_riscv64 started by recycler:
2026-May-21 12:38:22 :: message: sync
#100 build hd-idle-1.22-alt1.src.rpm
2026-May-21 12:38:33 :: [riscv64] #100 hd-idle-1.22-alt1.src.rpm: build start
[riscv64] + export RELEASE_VERSION=v1.22
[riscv64] + RELEASE_VERSION=v1.22
[riscv64] + export RELEASE_NUMBER=1.22
[riscv64] + RELEASE_NUMBER=1.22
[riscv64] + pushd .gopath/src/github.com/adelolmo/hd-idle
[riscv64] ~/RPM/BUILD/hd-idle-1.22/.gopath/src/github.com/adelolmo/hd-idle ~/RPM/BUILD/hd-idle-1.22
[riscv64] + /usr/bin/make 'INSTALL=/usr/libexec/rpm-build/install -p' prefix=/usr/src/tmp/hd-idle-buildroot/usr exec_prefix=/usr/src/tmp/hd-idle-buildroot/usr bindir=/usr/src/tmp/hd-idle-buildroot/usr/bin sbindir=/usr/src/tmp/hd-idle-buildroot/usr/sbin sysconfdir=/usr/src/tmp/hd-idle-buildroot/etc datadir=/usr/src/tmp/hd-idle-buildroot/usr/share includedir=/usr/src/tmp/hd-idle-buildroot/usr/include libdir=/usr/src/tmp/hd-idle-buildroot/usr/lib64 libexecdir=/usr/src/tmp/hd-idle-buildroot/usr/lib localstatedir=/usr/src/tmp/hd-idle-buildroot/var/lib runstatedir=/usr/src/tmp/hd-idle-buildroot/var/run sharedstatedir=/usr/src/tmp/hd-idle-buildroot/var/lib mandir=/usr/src/tmp/hd-idle-buildroot/usr/share/man infodir=/usr/src/tmp/hd-idle-buildroot/usr/share/info install DESTDIR=/usr/src/tmp/hd-idle-buildroot
[riscv64] make: Entering directory '/usr/src/RPM/BUILD/hd-idle-1.22/.gopath/src/github.com/adelolmo/hd-idle'
[riscv64] Makefile:43: *** Invalid ARCH: . Stop.
[riscv64] make: Leaving directory '/usr/src/RPM/BUILD/hd-idle-1.22/.gopath/src/github.com/adelolmo/hd-idle'
2026-May-21 12:42:08 :: [riscv64] hd-idle-1.22-alt1.src.rpm: remote: build failed
2026-May-21 12:42:08 :: [riscv64] #100 hd-idle-1.22-alt1.src.rpm: build FAILED
2026-May-21 12:42:08 :: [riscv64] requesting cancellation of task processing
2026-May-21 12:42:09 :: [riscv64] build FAILED
2026-May-21 12:42:09 :: task #126331 for sisyphus_riscv64 FAILED
More information about the Riscv-reports
mailing list