[riscv-reports] [#126263] sisyphus_riscv64 FAILED srpm=llama.cpp-9245-alt1.src.rpm

Girar sisyphus_riscv64 awaiter recycler noreply at basealt.ru
Thu May 21 11:16:33 MSK 2026


http://web.build.srt.basealt.ru/tasks/126263/logs/events.1.1.log

subtask  name       riscv64
   #100  llama.cpp   failed

2026-May-21 07:57:38 :: shared task #126263 for sisyphus_riscv64 started by recycler:
2026-May-21 07:57:38 :: message: sync
#100 build llama.cpp-9245-alt1.src.rpm
2026-May-21 07:57:46 :: [riscv64] #100 llama.cpp-9245-alt1.src.rpm: build start
[riscv64] [100%] Built target test-chat
[riscv64] gmake[1]: Leaving directory '/usr/src/RPM/BUILD/llama.cpp-9245/riscv64-alt-linux'
[riscv64] gmake: Entering directory '/usr/src/RPM/BUILD/llama.cpp-9245/riscv64-alt-linux'
[riscv64] /usr/bin/cmake -E cmake_progress_start /usr/src/RPM/BUILD/llama.cpp-9245/riscv64-alt-linux/CMakeFiles 0
[riscv64] gmake: Leaving directory '/usr/src/RPM/BUILD/llama.cpp-9245/riscv64-alt-linux'
[riscv64] + find -name '*.py'
[riscv64] + xargs sed -i '1s|#!/usr/bin/env python3|#!/usr/bin/python3|'
[riscv64] + LD_LIBRARY_PATH=riscv64-alt-linux/bin
[riscv64] + riscv64-alt-linux/bin/llama-server --completion-bash
[riscv64] /usr/src/tmp/rpm-tmp.10486: line 160: 2498366 Illegal instruction     LD_LIBRARY_PATH=riscv64-alt-linux/bin riscv64-alt-linux/bin/llama-server --completion-bash > llama.bash
2026-May-21 08:16:32 :: [riscv64] llama.cpp-9245-alt1.src.rpm: remote: build failed
2026-May-21 08:16:32 :: [riscv64] #100 llama.cpp-9245-alt1.src.rpm: build FAILED
2026-May-21 08:16:32 :: [riscv64] requesting cancellation of task processing
2026-May-21 08:16:33 :: [riscv64] build FAILED
2026-May-21 08:16:33 :: task #126263 for sisyphus_riscv64 FAILED


More information about the Riscv-reports mailing list