[riscv-reports] [#125733] sisyphus_riscv64 FAILED srpm=openrazer-3.12.2-alt1.src.rpm srpm=polychromatic-0.9.7-alt1.src.rpm

Girar sisyphus_riscv64 awaiter recycler noreply at basealt.ru
Sat May 16 12:24:44 MSK 2026


http://web.build.srt.basealt.ru/tasks/125733/logs/events.1.1.log

subtask  name       riscv64
   #100  openrazer     4:42

2026-May-16 09:18:20 :: shared task #125733 for sisyphus_riscv64 started by recycler:
2026-May-16 09:18:20 :: message: sync
#100 build openrazer-3.12.2-alt1.src.rpm
#200 build polychromatic-0.9.7-alt1.src.rpm
2026-May-16 09:18:20 :: created build repo
2026-May-16 09:18:25 :: [riscv64] #100 openrazer-3.12.2-alt1.src.rpm: build start
2026-May-16 09:23:07 :: [riscv64] #100 openrazer-3.12.2-alt1.src.rpm: build OK
2026-May-16 09:23:07 :: [riscv64] #200 polychromatic-0.9.7-alt1.src.rpm: build start
2026-May-16 09:24:43 :: [riscv64] #200 polychromatic-0.9.7-alt1.src.rpm: build SKIPPED
2026-May-16 09:24:44 :: 100: build check OK
2026-May-16 09:24:44 :: #200: polychromatic-0.9.7-alt1.src.rpm: no source package
2026-May-16 09:24:44 :: build check FAILED for: #200 
2026-May-16 09:24:44 :: task #125733 for sisyphus_riscv64 FAILED


More information about the Riscv-reports mailing list