[riscv-reports] [#125656] sisyphus_riscv64 FAILED srpm=worminator-3.0R2.1-alt2_41.1.src.rpm
Girar sisyphus_riscv64 awaiter recycler
noreply at basealt.ru
Sat May 16 09:10:01 MSK 2026
http://web.build.srt.basealt.ru/tasks/125656/logs/events.1.1.log
subtask name riscv64
#100 worminator 2:55
2026-May-16 06:05:56 :: shared task #125656 for sisyphus_riscv64 started by recycler:
2026-May-16 06:05:56 :: message: sync
#100 build worminator-3.0R2.1-alt2_41.1.src.rpm
2026-May-16 06:06:02 :: [riscv64] #100 worminator-3.0R2.1-alt2_41.1.src.rpm: build start
2026-May-16 06:08:57 :: [riscv64] #100 worminator-3.0R2.1-alt2_41.1.src.rpm: build OK
2026-May-16 06:08:58 :: 100: build check OK
2026-May-16 06:08:58 :: build check OK
2026-May-16 06:08:58 :: #100: worminator-3.0R2.1-alt2_41.1.src.rpm: version check OK
2026-May-16 06:08:58 :: build version check OK
2026-May-16 06:08:58 :: noarch check OK
2026-May-16 06:08:59 :: plan: src +1 -0 =20977, riscv64 +2 -0 =37091
2026-May-16 06:09:24 :: patched apt indices
2026-May-16 06:09:27 :: created next repo
2026-May-16 06:09:36 :: duplicate provides check OK
riscv64: NEW unmet dependencies detected:
worminator#3.0R2.1-alt2_41.1:sisyphus_riscv64+125656.100.1.1 at 1778911729 worminator-data >= 3.0R2.1
ACLs of affected packages (1):
worminator
2026-May-16 06:10:01 :: unmets: riscv64 +1 -0 =1
2026-May-16 06:10:01 :: dependencies check FAILED
2026-May-16 06:10:01 :: task #125656 for sisyphus_riscv64 FAILED
More information about the Riscv-reports
mailing list