[riscv-reports] [#125382] sisyphus_riscv64 FAILED srpm=crush-0.67.0-alt1.src.rpm
Girar sisyphus_riscv64 awaiter recycler
noreply at basealt.ru
Fri May 15 03:36:33 MSK 2026
http://web.build.srt.basealt.ru/tasks/125382/logs/events.1.1.log
subtask name riscv64
#100 crush failed
2026-May-15 00:34:30 :: shared task #125382 for sisyphus_riscv64 started by recycler:
2026-May-15 00:34:30 :: message: sync
#100 build crush-0.67.0-alt1.src.rpm
2026-May-15 00:34:35 :: [riscv64] #100 crush-0.67.0-alt1.src.rpm: build start
[riscv64] 'vendor/mvdan.cc/sh/v3/syntax/parser.go' -> '/usr/src/RPM/BUILD/crush-0.67.0/.build/src/github.com/charmbracelet/crush/vendor/mvdan.cc/sh/v3/syntax/parser.go'
[riscv64] 'vendor/mvdan.cc/sh/v3/syntax/parser_arithm.go' -> '/usr/src/RPM/BUILD/crush-0.67.0/.build/src/github.com/charmbracelet/crush/vendor/mvdan.cc/sh/v3/syntax/parser_arithm.go'
[riscv64] 'vendor/mvdan.cc/sh/v3/syntax/printer.go' -> '/usr/src/RPM/BUILD/crush-0.67.0/.build/src/github.com/charmbracelet/crush/vendor/mvdan.cc/sh/v3/syntax/printer.go'
[riscv64] 'vendor/mvdan.cc/sh/v3/syntax/quote.go' -> '/usr/src/RPM/BUILD/crush-0.67.0/.build/src/github.com/charmbracelet/crush/vendor/mvdan.cc/sh/v3/syntax/quote.go'
[riscv64] 'vendor/mvdan.cc/sh/v3/syntax/simplify.go' -> '/usr/src/RPM/BUILD/crush-0.67.0/.build/src/github.com/charmbracelet/crush/vendor/mvdan.cc/sh/v3/syntax/simplify.go'
[riscv64] 'vendor/mvdan.cc/sh/v3/syntax/token_string.go' -> '/usr/src/RPM/BUILD/crush-0.67.0/.build/src/github.com/charmbracelet/crush/vendor/mvdan.cc/sh/v3/syntax/token_string.go'
[riscv64] 'vendor/mvdan.cc/sh/v3/syntax/tokens.go' -> '/usr/src/RPM/BUILD/crush-0.67.0/.build/src/github.com/charmbracelet/crush/vendor/mvdan.cc/sh/v3/syntax/tokens.go'
[riscv64] 'vendor/mvdan.cc/sh/v3/syntax/walk.go' -> '/usr/src/RPM/BUILD/crush-0.67.0/.build/src/github.com/charmbracelet/crush/vendor/mvdan.cc/sh/v3/syntax/walk.go'
[riscv64] + /usr/share/golang/golang-build .build/src/github.com/charmbracelet/crush
[riscv64] go: go.mod requires go >= 1.26.3 (running go 1.26.2; GOTOOLCHAIN=local)
2026-May-15 00:36:33 :: [riscv64] crush-0.67.0-alt1.src.rpm: remote: build failed
2026-May-15 00:36:33 :: [riscv64] #100 crush-0.67.0-alt1.src.rpm: build FAILED
2026-May-15 00:36:33 :: [riscv64] requesting cancellation of task processing
2026-May-15 00:36:33 :: [riscv64] build FAILED
2026-May-15 00:36:33 :: task #125382 for sisyphus_riscv64 FAILED
More information about the Riscv-reports
mailing list