[riscv-reports] [#125360] sisyphus_riscv64 FAILED srpm=ryzenadj-0.19.0-alt1.src.rpm
Girar sisyphus_riscv64 awaiter recycler
noreply at basealt.ru
Fri May 15 01:37:56 MSK 2026
http://web.build.srt.basealt.ru/tasks/125360/logs/events.1.1.log
2026-May-14 22:36:41 :: shared task #125360 for sisyphus_riscv64 started by recycler:
2026-May-14 22:36:41 :: message: sync
#100 build ryzenadj-0.19.0-alt1.src.rpm
2026-May-14 22:36:47 :: [riscv64] #100 ryzenadj-0.19.0-alt1.src.rpm: build start
2026-May-14 22:37:56 :: [riscv64] #100 ryzenadj-0.19.0-alt1.src.rpm: build SKIPPED
2026-May-14 22:37:56 :: #100: ryzenadj-0.19.0-alt1.src.rpm: no source package
2026-May-14 22:37:56 :: build check FAILED for: #100
2026-May-14 22:37:56 :: task #125360 for sisyphus_riscv64 FAILED
More information about the Riscv-reports
mailing list