[riscv-reports] [#125211] sisyphus_riscv64 FAILED srpm=python3-module-django-6.0.5-alt1.src.rpm ...

Girar sisyphus_riscv64 awaiter recycler noreply at basealt.ru
Thu May 14 23:42:45 MSK 2026


http://web.build.srt.basealt.ru/tasks/125211/logs/events.1.1.log

subtask  name                   riscv64
   #100  python3-module-django   failed

2026-May-14 19:51:20 :: shared task #125211 for sisyphus_riscv64 started by recycler:
2026-May-14 19:51:20 :: message: sync
#100 build python3-module-django-6.0.5-alt1.src.rpm
#200 build python3-module-zensical-0.0.40-alt1.src.rpm
#300 build netbox-4.6.0-alt1.src.rpm
#400 build python3-module-pynetbox-7.7.0-alt1.src.rpm
#500 build netbox-dns-1.5.8-alt1.src.rpm
#600 build python3-module-netbox-sdk-0.0.8.post1-alt1.src.rpm
#700 build proxbox-api-0.0.10.post3-alt1.src.rpm
#1000 build netbox-proxbox-0.0.14-alt1.src.rpm
#1100 build netbox-ip-monitor-0.1.5-alt1.src.rpm
#1200 build python3-module-oracledb-4.0.0-alt1.src.rpm
2026-May-14 19:51:20 :: created build repo
2026-May-14 19:51:25 :: [riscv64] #100 python3-module-django-6.0.5-alt1.src.rpm: build start
[riscv64] A floating point mtime does not disturb was_modified_since (#18675). ... ok
[riscv64] ERROR: test_double_replaced_migrations_are_checked_correctly (migrations.test_commands.SquashMigrationsTests.test_double_replaced_migrations_are_checked_correctly)
[riscv64] If replaced migrations are already applied and replacing migrations
[riscv64] --
[riscv64]   File "<frozen importlib._bootstrap>", line 1324, in _find_and_load_unlocked
[riscv64] ModuleNotFoundError: No module named 'tmpi3iizjsi.migrations.0001_initial_squashed_0002_auto_20260514_1533_squashed_0003_auto_20260514_1533'
[riscv64] Ran 18699 tests in 2675.351s
[riscv64] FAILED (errors=1, skipped=1566, expected failures=5)
[riscv64] Destroying test database for alias 'default' ('file:memorydb_default?mode=memory&cache=shared')...
2026-May-14 20:42:44 :: [riscv64] python3-module-django-6.0.5-alt1.src.rpm: remote: build failed
2026-May-14 20:42:44 :: [riscv64] #100 python3-module-django-6.0.5-alt1.src.rpm: build FAILED
2026-May-14 20:42:44 :: [riscv64] requesting cancellation of task processing
2026-May-14 20:42:44 :: [riscv64] build FAILED
2026-May-14 20:42:44 :: task #125211 for sisyphus_riscv64 FAILED


More information about the Riscv-reports mailing list