[riscv-reports] [#125326] sisyphus_riscv64 FAILED srpm=dolphin-emu-2603a-alt1.src.rpm
Girar sisyphus_riscv64 awaiter recycler
noreply at basealt.ru
Thu May 14 23:39:14 MSK 2026
http://web.build.srt.basealt.ru/tasks/125326/logs/events.1.1.log
2026-May-14 20:37:41 :: shared task #125326 for sisyphus_riscv64 started by recycler:
2026-May-14 20:37:41 :: message: sync
#100 build dolphin-emu-2603a-alt1.src.rpm
2026-May-14 20:37:44 :: [riscv64] #100 dolphin-emu-2603a-alt1.src.rpm: build start
2026-May-14 20:39:14 :: [riscv64] #100 dolphin-emu-2603a-alt1.src.rpm: build SKIPPED
2026-May-14 20:39:14 :: #100: dolphin-emu-2603a-alt1.src.rpm: no source package
2026-May-14 20:39:14 :: build check FAILED for: #100
2026-May-14 20:39:14 :: task #125326 for sisyphus_riscv64 FAILED
More information about the Riscv-reports
mailing list