[riscv-reports] [#124967] sisyphus_riscv64 FAILED srpm=klevernotes-1.3.1-alt1.src.rpm

Girar sisyphus_riscv64 awaiter recycler noreply at basealt.ru
Thu May 14 21:15:04 MSK 2026


http://web.build.srt.basealt.ru/tasks/124967/logs/events.1.1.log

2026-May-14 18:13:55 :: shared task #124967 for sisyphus_riscv64 started by recycler:
2026-May-14 18:13:55 :: message: sync
#100 build klevernotes-1.3.1-alt1.src.rpm
2026-May-14 18:14:00 :: [riscv64] #100 klevernotes-1.3.1-alt1.src.rpm: build start
2026-May-14 18:15:03 :: [riscv64] #100 klevernotes-1.3.1-alt1.src.rpm: build SKIPPED
2026-May-14 18:15:03 :: #100: klevernotes-1.3.1-alt1.src.rpm: no source package
2026-May-14 18:15:04 :: build check FAILED for: #100 
2026-May-14 18:15:04 :: task #124967 for sisyphus_riscv64 FAILED


More information about the Riscv-reports mailing list