[riscv-reports] [#125241] sisyphus_riscv64 FAILED srpm=cilium-1.19.3-alt1.src.rpm srpm=cilium-certgen-0.4.3-alt1.src.rpm
Girar sisyphus_riscv64 awaiter recycler
noreply at basealt.ru
Thu May 14 16:05:56 MSK 2026
http://web.build.srt.basealt.ru/tasks/125241/logs/events.1.1.log
subtask name riscv64
#200 cilium-certgen 7:52
2026-May-14 12:55:42 :: shared task #125241 for sisyphus_riscv64 started by recycler:
2026-May-14 12:55:42 :: message: sync
#100 build cilium-1.19.3-alt1.src.rpm
#200 build cilium-certgen-0.4.3-alt1.src.rpm
2026-May-14 12:55:42 :: created build repo
2026-May-14 12:55:50 :: [riscv64] #100 cilium-1.19.3-alt1.src.rpm: build start
2026-May-14 12:58:03 :: [riscv64] #100 cilium-1.19.3-alt1.src.rpm: build SKIPPED
2026-May-14 12:58:03 :: [riscv64] #200 cilium-certgen-0.4.3-alt1.src.rpm: build start
2026-May-14 13:05:55 :: [riscv64] #200 cilium-certgen-0.4.3-alt1.src.rpm: build OK
2026-May-14 13:05:55 :: #100: cilium-1.19.3-alt1.src.rpm: no source package
2026-May-14 13:05:56 :: 200: build check OK
2026-May-14 13:05:56 :: build check FAILED for: #100
2026-May-14 13:05:56 :: task #125241 for sisyphus_riscv64 FAILED
More information about the Riscv-reports
mailing list