[riscv-reports] [#125193] sisyphus_riscv64 FAILED (try 5) srpm=libllhttp-9.4.1-alt1.src.rpm ...
Girar sisyphus_riscv64 awaiter recycler
noreply at basealt.ru
Thu May 14 15:53:34 MSK 2026
http://web.build.srt.basealt.ru/tasks/125193/logs/events.5.1.log
subtask name riscv64
#400 python3-module-aiohttp failed
2026-May-14 12:43:32 :: shared task #125193 for sisyphus_riscv64 resumed by recycler:
2026-May-14 12:43:32 :: message: sync
#100 build libllhttp-9.4.1-alt1.src.rpm
#200 build python3-module-httptools-0.7.1-alt1.1.src.rpm
#240 removed
#300 removed
#400 build python3-module-aiohttp-3.13.5-alt1.src.rpm from sisyphus_riscv64
2026-May-14 12:43:32 :: created build repo
2026-May-14 12:43:37 :: [riscv64] #100 libllhttp-9.4.1-alt1.src.rpm: build start
2026-May-14 12:43:40 :: [riscv64] #100 libllhttp-9.4.1-alt1.src.rpm: build swiftly SKIPPED
2026-May-14 12:43:40 :: [riscv64] #200 python3-module-httptools-0.7.1-alt1.1.src.rpm: build start
2026-May-14 12:43:42 :: [riscv64] #200 python3-module-httptools-0.7.1-alt1.1.src.rpm: build swiftly SKIPPED
2026-May-14 12:43:42 :: [riscv64] #400 python3-module-aiohttp-3.13.5-alt1.src.rpm: build start
[riscv64] > assert elapsed < 0.3, f"Connection closure took too long: {elapsed}s"
[riscv64] E AssertionError: Connection closure took too long: 0.39298945300106425s
[riscv64] E assert 0.39298945300106425 < 0.3
[riscv64] --
[riscv64] ------------------------------ Captured log call -------------------------------
[riscv64] ERROR aiohttp.server:web_protocol.py:488 Error handling request from 127.0.0.1
[riscv64] Traceback (most recent call last):
[riscv64] --
[riscv64] raise ClientConnectionResetError("Cannot write to closing transport")
[riscv64] aiohttp.client_exceptions.ClientConnectionResetError: Cannot write to closing transport
[riscv64] =========================== short test summary info ============================
[riscv64] --
[riscv64] SKIPPED [1] tests/test_multipart_helpers.py:519: urllib.parse.unquote is tolerate to standalone % chars
[riscv64] SKIPPED [1] tests/test_multipart_helpers.py:446: should raise decoding error: %82 is invalid for latin1
[riscv64] SKIPPED [1] tests/test_multipart_helpers.py:455: should raise decoding error: %E4 is invalid for utf-8
[riscv64] SKIPPED [1] tests/test_resolver.py:467: aiodns <3.2.0 required
[riscv64] --
[riscv64] XFAIL tests/test_http_parser.py::test_parse_uri_utf8[c-parser-pyloop] - Not valid HTTP. Maybe update py-parser to reject later.
[riscv64] FAILED tests/test_client_functional.py::test_ssl_client_shutdown_timeout[pyloop]
[riscv64] = 1 failed, 4320 passed, 25 skipped, 5 xfailed, 2 subtests passed in 184.76s (0:03:04) =
[riscv64] INFO : Command's result: FAILURE
[riscv64] INFO : Command's error: Command '['pytest', '-m', 'not dev_mode and not internal', '-vra', '-o=addopts=', '-n', 'auto', '--ignore=tests/autobahn', '--ignore=tests/test_proxy_functional.py', '--ignore-glob=tests/test_benchmarks_*', '--deselect=tests/test_web_functional.py::test_keepalive_expires_on_time', 'tests']' returned non-zero exit status 1.
2026-May-14 12:53:33 :: [riscv64] python3-module-aiohttp-3.13.5-alt1.src.rpm: remote: build failed
2026-May-14 12:53:33 :: [riscv64] #400 python3-module-aiohttp-3.13.5-alt1.src.rpm: build FAILED
2026-May-14 12:53:33 :: [riscv64] requesting cancellation of task processing
2026-May-14 12:53:33 :: [riscv64] build FAILED
2026-May-14 12:53:33 :: task #125193 for sisyphus_riscv64 FAILED
More information about the Riscv-reports
mailing list