[riscv-reports] [#125175] sisyphus_riscv64 FAILED srpm=firmware-xiaomi-beryllium-1-alt1.src.rpm ...
Girar sisyphus_riscv64 awaiter recycler
noreply at basealt.ru
Thu May 14 12:27:17 MSK 2026
http://web.build.srt.basealt.ru/tasks/125175/logs/events.1.1.log
subtask name riscv64
#300 wireplumber-config-qualcomm 2:12
#400 call-audio-idle-suspend-workaround 2:34
#500 startup-config-qualcomm 2:44
2026-May-14 09:16:06 :: shared task #125175 for sisyphus_riscv64 started by recycler:
2026-May-14 09:16:06 :: message: sync
#100 build firmware-xiaomi-beryllium-1-alt1.src.rpm
#200 build firmware-oneplus-sdm845-1-alt1.src.rpm
#300 build wireplumber-config-qualcomm-1-alt1.src.rpm
#400 build call-audio-idle-suspend-workaround-1-alt1.src.rpm
#500 build startup-config-qualcomm-1-alt1.src.rpm
2026-May-14 09:16:07 :: created build repo
2026-May-14 09:16:11 :: [riscv64] #100 firmware-xiaomi-beryllium-1-alt1.src.rpm: build start
2026-May-14 09:18:12 :: [riscv64] #100 firmware-xiaomi-beryllium-1-alt1.src.rpm: build SKIPPED
2026-May-14 09:18:12 :: [riscv64] #200 firmware-oneplus-sdm845-1-alt1.src.rpm: build start
2026-May-14 09:19:45 :: [riscv64] #200 firmware-oneplus-sdm845-1-alt1.src.rpm: build SKIPPED
2026-May-14 09:19:45 :: [riscv64] #300 wireplumber-config-qualcomm-1-alt1.src.rpm: build start
2026-May-14 09:21:57 :: [riscv64] #300 wireplumber-config-qualcomm-1-alt1.src.rpm: build OK
2026-May-14 09:21:57 :: [riscv64] #400 call-audio-idle-suspend-workaround-1-alt1.src.rpm: build start
2026-May-14 09:24:31 :: [riscv64] #400 call-audio-idle-suspend-workaround-1-alt1.src.rpm: build OK
2026-May-14 09:24:31 :: [riscv64] #500 startup-config-qualcomm-1-alt1.src.rpm: build start
2026-May-14 09:27:15 :: [riscv64] #500 startup-config-qualcomm-1-alt1.src.rpm: build OK
2026-May-14 09:27:16 :: #100: firmware-xiaomi-beryllium-1-alt1.src.rpm: no source package
2026-May-14 09:27:16 :: #200: firmware-oneplus-sdm845-1-alt1.src.rpm: no source package
2026-May-14 09:27:16 :: 300: build check OK
2026-May-14 09:27:17 :: 400: build check OK
2026-May-14 09:27:17 :: 500: build check OK
2026-May-14 09:27:17 :: build check FAILED for: #100 #200
2026-May-14 09:27:17 :: task #125175 for sisyphus_riscv64 FAILED
More information about the Riscv-reports
mailing list