[riscv-reports] [#124934] sisyphus_riscv64 FAILED srpm=python3-module-hyprland-monitors-0.5.0-alt1.src.rpm ...

Girar sisyphus_riscv64 awaiter recycler noreply at basealt.ru
Wed May 13 14:24:34 MSK 2026


http://web.build.srt.basealt.ru/tasks/124934/logs/events.1.1.log

subtask  name                              riscv64
   #100  python3-module-hyprland-monitors   failed

2026-May-13 11:22:16 :: shared task #124934 for sisyphus_riscv64 started by recycler:
2026-May-13 11:22:16 :: message: sync
#100 build python3-module-hyprland-monitors-0.5.0-alt1.src.rpm
#200 build python3-module-hyprland-socket-0.10.0-alt1.src.rpm
#300 build python3-module-hyprland-state-0.2.1-alt1.src.rpm
#400 build hyprmod-0.2.0-alt1.src.rpm
2026-May-13 11:22:16 :: created build repo
2026-May-13 11:22:22 :: [riscv64] #100 python3-module-hyprland-monitors-0.5.0-alt1.src.rpm: build start
[riscv64] <13>May 13 11:24:26 rpmi: libsqlite3-3.50.4-alt1 sisyphus_riscv64+91443.100.1.1 1754555936 installed
[riscv64] <13>May 13 11:24:26 rpmi: libmpdec3-2.5.1-alt3 sisyphus_riscv64+29035.100.1.1 1675621702 installed
[riscv64] <13>May 13 11:24:26 rpmi: libexpat-2.7.4-alt1 sisyphus_riscv64+109313.100.1.1 1770323898 installed
[riscv64] <13>May 13 11:24:26 rpmi: openssl-config-3.5.0-alt1 sisyphus_riscv64+99925.100.1.1 1762587030 installed
[riscv64] <13>May 13 11:24:26 rpmi: libb2-0.98.1-alt1_1 sisyphus_riscv64+13721.100.1.1 1638969645 installed
[riscv64] <13>May 13 11:24:26 rpmi: libp11-kit-1:0.25.10-alt2 sisyphus_riscv64+102359.300.1.2 1764647411 installed
[riscv64] <13>May 13 11:24:26 rpmi: libtasn1-4.21.0-alt1 sisyphus_riscv64+110145.100.1.1 1770759719 installed
[riscv64] <13>May 13 11:24:26 rpmi: rpm-macros-alternatives-0.5.3-alt1 sisyphus_riscv64+71244.100.1.1 1738025117 installed
[riscv64] <13>May 13 11:24:26 rpmi: alternatives-0.5.3-alt1 sisyphus_riscv64+71244.100.1.1 1738025117 installed
[riscv64] <13>May 13 11:24:26 rpmi: ca-certificates-2026.04.22-alt1 sisyphus_riscv64+124784.100.1.1 1778294417 installed
[riscv64] <13>May 13 11:24:26 rpmi: ca-trust-0.2.0-alt1 sisyphus_riscv64+47419.100.1.1 1712764300 installed
[riscv64] <13>May 13 11:24:26 rpmi: p11-kit-trust-1:0.25.10-alt2 sisyphus_riscv64+102359.300.1.2 1764647411 installed
[riscv64] <13>May 13 11:24:26 rpmi: libcrypto3-3.5.4-alt1 sisyphus_riscv64+99925.200.1.1 1762591620 installed
[riscv64] <13>May 13 11:24:26 rpmi: libssl3-3.5.4-alt1 sisyphus_riscv64+99925.200.1.1 1762591620 installed
[riscv64] <13>May 13 11:24:27 rpmi: python3-modules-sqlite3-3.13.12-alt3 sisyphus_riscv64+119616.100.1.1 1776677221 installed
[riscv64] <13>May 13 11:24:27 rpmi: python3-3.13.12-alt3 sisyphus_riscv64+119616.100.1.1 1776677221 installed
[riscv64] <13>May 13 11:24:28 rpmi: python3-base-3.13.12-alt3 sisyphus_riscv64+119616.100.1.1 1776677221 installed
[riscv64] <13>May 13 11:24:28 rpmi: python3-module-py3dephell-0.3.1-alt1 sisyphus_riscv64+67758.200.1.1 1734524951 installed
[riscv64] <13>May 13 11:24:28 rpmi: tests-for-installed-python3-pkgs-0.1.29-alt1 sisyphus_riscv64+100285.100.1.1 1762815565 installed
[riscv64] <13>May 13 11:24:28 rpmi: rpm-build-python3-0.1.29-alt1 sisyphus_riscv64+100285.100.1.1 1762815565 installed
[riscv64] Reading Package Lists...
[riscv64] Building Dependency Tree...
[riscv64] MI2a: marked for install (shallow): python3-module-hatchling
[riscv64] MI2a:  satisfying Depends: python3-module-packaging  (NULL)
[riscv64] MI2a:   maybe install (a direct target): python3-module-packaging 26.2-alt1:sisyphus_riscv64+121046.100.1.1 at 1778311400
[riscv64] MI2a:  target SELECTED: python3-module-packaging 26.2-alt1:sisyphus_riscv64+121046.100.1.1 at 1778311400
[riscv64] MI2a:  requesting to install python3-module-packaging (unspec'd ver; inspect with Debug::pkgMark-shallow)
[riscv64] MI2a:    marked for install (shallow): python3-module-packaging
[riscv64] MI2a:  satisfying Depends: python3-module-pathspec  (NULL)
[riscv64] MI2a:   maybe install (a direct target): python3-module-pathspec 1.1.1-alt1:sisyphus_riscv64+121210.100.2.1 at 1778320386
[riscv64] MI2a:  target SELECTED: python3-module-pathspec 1.1.1-alt1:sisyphus_riscv64+121210.100.2.1 at 1778320386
[riscv64] MI2a:  requesting to install python3-module-pathspec (unspec'd ver; inspect with Debug::pkgMark-shallow)
[riscv64] MI2a:    marked for install (shallow): python3-module-pathspec
[riscv64] MI2a:  satisfying Depends: python3-module-pluggy  (NULL)
[riscv64] MI2a:   maybe install (a direct target): python3-module-pluggy 1.6.0-alt1.1:sisyphus_riscv64+116951.300.1.1 at 1774868949
[riscv64] MI2a:  target SELECTED: python3-module-pluggy 1.6.0-alt1.1:sisyphus_riscv64+116951.300.1.1 at 1774868949
[riscv64] MI2a:  requesting to install python3-module-pluggy (unspec'd ver; inspect with Debug::pkgMark-shallow)
[riscv64] MI2a:    marked for install (shallow): python3-module-pluggy
[riscv64] MI2a:  satisfying Depends: python3-module-trove-classifiers  (NULL)
[riscv64] MI2a:   maybe install (a direct target): python3-module-trove-classifiers 2026.4.28.13-alt1:sisyphus_riscv64+121378.100.1.1 at 1778354532
[riscv64] MI2a:  target SELECTED: python3-module-trove-classifiers 2026.4.28.13-alt1:sisyphus_riscv64+121378.100.1.1 at 1778354532
[riscv64] MI2a:  requesting to install python3-module-trove-classifiers (unspec'd ver; inspect with Debug::pkgMark-shallow)
[riscv64] MI2a:    marked for install (shallow): python3-module-trove-classifiers
[riscv64] MI2a: marked for install (shallow): python3-module-pytest
[riscv64] MI2a:  satisfying Depends: python3-module-iniconfig  (NULL)
[riscv64] MI2a:   maybe install (a direct target): python3-module-iniconfig 2.3.0-alt1:sisyphus_riscv64+98229.100.1.1 at 1761491259
[riscv64] MI2a:  target SELECTED: python3-module-iniconfig 2.3.0-alt1:sisyphus_riscv64+98229.100.1.1 at 1761491259
[riscv64] MI2a:  requesting to install python3-module-iniconfig (unspec'd ver; inspect with Debug::pkgMark-shallow)
[riscv64] MI2a:    marked for install (shallow): python3-module-iniconfig
[riscv64] MI2a:  satisfying Depends: python3-module-pygments  (NULL)
[riscv64] MI2a:   maybe install (a providing target): python3-module-Pygments 2.20.0-alt1:sisyphus_riscv64+117973.100.1.1 at 1775513420
[riscv64] MI2a:  target SELECTED: python3-module-Pygments 2.20.0-alt1:sisyphus_riscv64+117973.100.1.1 at 1775513420
[riscv64] MI2a:  requesting to install python3-module-Pygments (unspec'd ver; inspect with Debug::pkgMark-shallow)
[riscv64] MI2a:    marked for install (shallow): python3-module-Pygments
[riscv64] rpm-build-python3 is already the newest version.
[riscv64] E: Couldn't find package python3-module-hyprland-socket
[riscv64] hsh-install: Failed to calculate package file list.
[riscv64] hsh-install: Failed to generate package file list.
2026-May-13 11:24:33 :: [riscv64] python3-module-hyprland-monitors-0.5.0-alt1.src.rpm: remote: cannot build src.rpm
2026-May-13 11:24:33 :: [riscv64] #100 python3-module-hyprland-monitors-0.5.0-alt1.src.rpm: build FAILED
2026-May-13 11:24:34 :: [riscv64] requesting cancellation of task processing
2026-May-13 11:24:34 :: [riscv64] build FAILED
2026-May-13 11:24:34 :: task #124934 for sisyphus_riscv64 FAILED


More information about the Riscv-reports mailing list