[riscv-reports] [#124929] sisyphus_riscv64 FAILED srpm=lact-0.9.0-alt1.src.rpm

Girar sisyphus_riscv64 awaiter recycler noreply at basealt.ru
Wed May 13 14:09:20 MSK 2026


http://web.build.srt.basealt.ru/tasks/124929/logs/events.1.1.log

2026-May-13 11:07:30 :: shared task #124929 for sisyphus_riscv64 started by recycler:
2026-May-13 11:07:30 :: message: sync
#100 build lact-0.9.0-alt1.src.rpm
2026-May-13 11:07:37 :: [riscv64] #100 lact-0.9.0-alt1.src.rpm: build start
2026-May-13 11:09:20 :: [riscv64] #100 lact-0.9.0-alt1.src.rpm: build SKIPPED
2026-May-13 11:09:20 :: #100: lact-0.9.0-alt1.src.rpm: no source package
2026-May-13 11:09:20 :: build check FAILED for: #100 
2026-May-13 11:09:20 :: task #124929 for sisyphus_riscv64 FAILED


More information about the Riscv-reports mailing list