[riscv-reports] [#124839] sisyphus_riscv64 FAILED srpm=libs2geometry-0.14.0-alt1.src.rpm srpm=pure-maps-3.5.0-alt1.src.rpm

Girar sisyphus_riscv64 awaiter recycler noreply at basealt.ru
Wed May 13 06:37:51 MSK 2026


http://web.build.srt.basealt.ru/tasks/124839/logs/events.1.1.log

subtask  name           riscv64
   #100  libs2geometry   failed

2026-May-13 03:34:06 :: shared task #124839 for sisyphus_riscv64 started by recycler:
2026-May-13 03:34:06 :: message: sync
#100 build libs2geometry-0.14.0-alt1.src.rpm
#200 build pure-maps-3.5.0-alt1.src.rpm
2026-May-13 03:34:06 :: created build repo
2026-May-13 03:34:13 :: [riscv64] #100 libs2geometry-0.14.0-alt1.src.rpm: build start
[riscv64] /usr/src/RPM/BUILD/libs2geometry-0.14.0/src/s2/s2builder_graph.h:693:44: error: expected ',' or '...' before 'error'
[riscv64]   693 |                      S2Error* absl_nonnull error,
[riscv64] /usr/src/RPM/BUILD/libs2geometry-0.14.0/src/s2/s2builder_graph.h:709:3: error: 'IsFullPolygonPredicate' does not name a type
[riscv64]   709 |   IsFullPolygonPredicate is_full_polygon_predicate_;
[riscv64] /usr/src/RPM/BUILD/libs2geometry-0.14.0/src/s2/s2builder_graph.h:845:67: error: expected ',' or '...' before 'error'
[riscv64]   845 | inline bool S2Builder::Graph::IsFullPolygon(S2Error* absl_nonnull error) const {
[riscv64] /usr/src/RPM/BUILD/libs2geometry-0.14.0/src/s2/s2builder_graph.h: In member function 'bool S2Builder::Graph::IsFullPolygon(S2Error*) const':
[riscv64] /usr/src/RPM/BUILD/libs2geometry-0.14.0/src/s2/s2builder_graph.h:846:44: error: 'error' was not declared in this scope; did you mean 'perror'?
[riscv64]   846 |   return is_full_polygon_predicate_(*this, error);
[riscv64]       |                                            perror
[riscv64] /usr/src/RPM/BUILD/libs2geometry-0.14.0/src/s2/s2builder_graph.h:846:10: error: 'is_full_polygon_predicate_' was not declared in this scope; did you mean 'layer_is_full_polygon_predicates_'?
[riscv64]   846 |   return is_full_polygon_predicate_(*this, error);
[riscv64] --
[riscv64] /usr/src/RPM/BUILD/libs2geometry-0.14.0/src/s2/s2builder_graph.h: At global scope:
[riscv64] /usr/src/RPM/BUILD/libs2geometry-0.14.0/src/s2/s2builder_graph.h:849:25: error: 'IsFullPolygonPredicate' in 'class S2Builder' does not name a type
[riscv64]   849 | inline const S2Builder::IsFullPolygonPredicate&
[riscv64] In file included from /usr/src/RPM/BUILD/libs2geometry-0.14.0/src/s2/s2boolean_operation.h:31:
[riscv64] /usr/src/RPM/BUILD/libs2geometry-0.14.0/src/s2/s2builder_layer.h:51:60: error: expected ',' or '...' before 'error'
[riscv64]    51 |   virtual void Build(const Graph& g, S2Error* absl_nonnull error) = 0;
[riscv64] /usr/src/RPM/BUILD/libs2geometry-0.14.0/src/s2/s2boolean_operation.h:499:36: error: expected ',' or '...' before 'error'
[riscv64]   499 |              S2Error* absl_nonnull error);
[riscv64] In file included from /usr/src/RPM/BUILD/libs2geometry-0.14.0/src/s2/s2polygon.h:46:
[riscv64] /usr/src/RPM/BUILD/libs2geometry-0.14.0/src/s2/s2loop.h:185:50: error: expected ',' or '...' before 'error'
[riscv64]   185 |   bool FindValidationError(S2Error* absl_nonnull error) const;
[riscv64] /usr/src/RPM/BUILD/libs2geometry-0.14.0/src/s2/s2loop.h:565:57: error: expected ',' or '...' before 'error'
[riscv64]   565 |   bool FindValidationErrorNoIndex(S2Error* absl_nonnull error) const;
2026-May-13 03:37:50 :: [riscv64] libs2geometry-0.14.0-alt1.src.rpm: remote: build failed
2026-May-13 03:37:50 :: [riscv64] #100 libs2geometry-0.14.0-alt1.src.rpm: build FAILED
2026-May-13 03:37:50 :: [riscv64] requesting cancellation of task processing
2026-May-13 03:37:51 :: [riscv64] build FAILED
2026-May-13 03:37:51 :: task #124839 for sisyphus_riscv64 FAILED


More information about the Riscv-reports mailing list