[riscv-reports] [#124751] sisyphus_riscv64 FAILED srpm=dasel-3.8.1-alt1.src.rpm srpm=uncloud-0.19.0-alt1.src.rpm ...

Girar sisyphus_riscv64 awaiter recycler noreply at basealt.ru
Wed May 13 03:49:24 MSK 2026


http://web.build.srt.basealt.ru/tasks/124751/logs/events.1.1.log

subtask  name     riscv64
   #100  dasel       5:12
   #200  uncloud    12:32
   #300  systing   failed

2026-May-13 00:16:06 :: shared task #124751 for sisyphus_riscv64 started by recycler:
2026-May-13 00:16:06 :: message: sync
#100 build dasel-3.8.1-alt1.src.rpm
#200 build uncloud-0.19.0-alt1.src.rpm
#300 build systing-1.6.0-alt1.src.rpm
#400 build process-compose-1.110.0-alt1.src.rpm
#500 build oha-1.14.0-alt1.src.rpm
#600 build dtop-0.7.6-alt1.src.rpm
2026-May-13 00:16:06 :: created build repo
2026-May-13 00:16:11 :: [riscv64] #100 dasel-3.8.1-alt1.src.rpm: build start
2026-May-13 00:21:23 :: [riscv64] #100 dasel-3.8.1-alt1.src.rpm: build OK
2026-May-13 00:21:24 :: [riscv64] #200 uncloud-0.19.0-alt1.src.rpm: build start
2026-May-13 00:33:56 :: [riscv64] #200 uncloud-0.19.0-alt1.src.rpm: build OK
2026-May-13 00:33:56 :: [riscv64] #300 systing-1.6.0-alt1.src.rpm: build start
[riscv64]    Compiling zstd v0.13.3
[riscv64] error: failed to run custom build command for `systing v1.6.0 (/usr/src/RPM/BUILD/systing-1.6.0)`
[riscv64] Caused by:
2026-May-13 00:49:23 :: [riscv64] systing-1.6.0-alt1.src.rpm: remote: build failed
2026-May-13 00:49:23 :: [riscv64] #300 systing-1.6.0-alt1.src.rpm: build FAILED
2026-May-13 00:49:24 :: [riscv64] requesting cancellation of task processing
2026-May-13 00:49:24 :: [riscv64] build FAILED
2026-May-13 00:49:24 :: task #124751 for sisyphus_riscv64 FAILED


More information about the Riscv-reports mailing list