[riscv-reports] [#124307] sisyphus_riscv64 FAILED srpm=seaweedfs-4.23-alt1.src.rpm
Girar sisyphus_riscv64 awaiter recycler
noreply at basealt.ru
Tue May 12 13:03:24 MSK 2026
http://web.build.srt.basealt.ru/tasks/124307/logs/events.1.1.log
subtask name riscv64
#100 seaweedfs failed
2026-May-12 09:56:19 :: shared task #124307 for sisyphus_riscv64 started by recycler:
2026-May-12 09:56:19 :: message: sync
#100 build seaweedfs-4.23-alt1.src.rpm
2026-May-12 09:56:29 :: [riscv64] #100 seaweedfs-4.23-alt1.src.rpm: build start
[riscv64] # import config
[riscv64] packagefile github.com/seaweedfs/seaweedfs/weed/worker/tasks/balance=/usr/src/tmp/go-build3102659168/b599/_pkg_.a
[riscv64] packagefile github.com/seaweedfs/seaweedfs/weed/worker/tasks/ec_balance=/usr/src/tmp/go-build3102659168/b1289/_pkg_.a
[riscv64] packagefile github.com/seaweedfs/seaweedfs/weed/worker/tasks/erasure_coding=/usr/src/tmp/go-build3102659168/b736/_pkg_.a
[riscv64] packagefile github.com/seaweedfs/seaweedfs/weed/worker/tasks/iceberg=/usr/src/tmp/go-build3102659168/b1290/_pkg_.a
[riscv64] packagefile github.com/seaweedfs/seaweedfs/weed/worker/tasks/vacuum=/usr/src/tmp/go-build3102659168/b738/_pkg_.a
[riscv64] EOF
[riscv64] /usr/lib/golang/pkg/tool/linux_riscv64/compile -o $WORK/b1288/_pkg_.a -trimpath "$WORK/b1288=>" -p github.com/seaweedfs/seaweedfs/weed/plugin/worker/handlers -lang=go1.25 -complete -buildid hbaIKJiILRco-JR6upNS/hbaIKJiILRco-JR6upNS -goversion go1.26.2-X:nodwarf5 -c=64 -nolocalimports -importcfg $WORK/b1288/importcfg -pack ./plugin/worker/handlers/handlers.go
[riscv64] go tool buildid -w $WORK/b1288/_pkg_.a # internal
[riscv64] cp $WORK/b1288/_pkg_.a /usr/src/.cache/go-build/43/437ccc76b04d78f1873126b0cc20d5294b93bf05f2a455d0072cf35bb44f6ae6-d # internal
2026-May-12 10:03:23 :: [riscv64] seaweedfs-4.23-alt1.src.rpm: remote: build failed
2026-May-12 10:03:23 :: [riscv64] #100 seaweedfs-4.23-alt1.src.rpm: build FAILED
2026-May-12 10:03:23 :: [riscv64] requesting cancellation of task processing
2026-May-12 10:03:24 :: [riscv64] build FAILED
2026-May-12 10:03:24 :: task #124307 for sisyphus_riscv64 FAILED
More information about the Riscv-reports
mailing list