[riscv-reports] [#124246] sisyphus_riscv64 FAILED srpm=wavetable-1.0.32-alt1.src.rpm
Girar sisyphus_riscv64 awaiter recycler
noreply at basealt.ru
Tue May 12 01:41:56 MSK 2026
http://web.build.srt.basealt.ru/tasks/124246/logs/events.1.1.log
2026-May-11 22:40:13 :: shared task #124246 for sisyphus_riscv64 started by recycler:
2026-May-11 22:40:13 :: message: sync
#100 build wavetable-1.0.32-alt1.src.rpm
2026-May-11 22:40:19 :: [riscv64] #100 wavetable-1.0.32-alt1.src.rpm: build start
2026-May-11 22:41:55 :: [riscv64] #100 wavetable-1.0.32-alt1.src.rpm: build SKIPPED
2026-May-11 22:41:56 :: #100: wavetable-1.0.32-alt1.src.rpm: no source package
2026-May-11 22:41:56 :: build check FAILED for: #100
2026-May-11 22:41:56 :: task #124246 for sisyphus_riscv64 FAILED
More information about the Riscv-reports
mailing list