[riscv-reports] [#122013] sisyphus_riscv64 FAILED (try 2) srpm=qgis-4.0.2-alt1.src.rpm
Girar sisyphus_riscv64 awaiter recycler
noreply at basealt.ru
Mon May 11 16:16:01 MSK 2026
http://web.build.srt.basealt.ru/tasks/122013/logs/events.2.1.log
subtask name riscv64
#100 qgis failed
2026-May-11 10:27:21 :: shared task #122013 for sisyphus_riscv64 resumed by recycler:
2026-May-11 10:27:21 :: message: sync
#100 build qgis-4.0.2-alt1.src.rpm
2026-May-11 10:27:28 :: [riscv64] #100 qgis-4.0.2-alt1.src.rpm: build start
[riscv64] -- Installing: /usr/src/tmp/qgis-buildroot/usr/share/qgis/FindQGIS.cmake
[riscv64] /usr/src/RPM/BUILD/qgis-4.0.2/output/bin/crssync: error while loading shared libraries: libqgis_core.so.4.0.2: cannot open shared object file: No such file or directory
[riscv64] -- Installing: /usr/src/tmp/qgis-buildroot/usr/share/icons/hicolor/scalable/apps/qgis.svg
[riscv64] --
[riscv64] + sed -i /QtWebEngine/d /usr/src/tmp/qgis-buildroot/usr/share/qgis/python/qsci_apis/PyQt6.api
[riscv64] sed: can't read /usr/src/tmp/qgis-buildroot/usr/share/qgis/python/qsci_apis/PyQt6.api: No such file or directory
2026-May-11 13:16:00 :: [riscv64] qgis-4.0.2-alt1.src.rpm: remote: build failed
2026-May-11 13:16:00 :: [riscv64] #100 qgis-4.0.2-alt1.src.rpm: build FAILED
2026-May-11 13:16:00 :: [riscv64] requesting cancellation of task processing
2026-May-11 13:16:01 :: [riscv64] build FAILED
2026-May-11 13:16:01 :: task #122013 for sisyphus_riscv64 FAILED
More information about the Riscv-reports
mailing list