[riscv-reports] [#121680] sisyphus_riscv64 FAILED srpm=ibus-1.5.34-alt1.src.rpm srpm=libgtk4-4.22.4-alt1.src.rpm ...

Girar sisyphus_riscv64 awaiter recycler noreply at basealt.ru
Sun May 10 09:09:33 MSK 2026


http://web.build.srt.basealt.ru/tasks/121680/logs/events.1.2.log

subtask  name      riscv64
   #100  ibus        26:03
   #200  libgtk4     20:36
   #300  qjackctl     7:15

2026-May-10 05:51:43 :: shared task #121680 for sisyphus_riscv64 started by recycler:
2026-May-10 05:51:43 :: message: sync
#100 build ibus-1.5.34-alt1.src.rpm
#200 build libgtk4-4.22.4-alt1.src.rpm
#300 build qjackctl-1.0.6-alt1.src.rpm
2026-May-10 05:51:43 :: created build repo
2026-May-10 05:52:03 :: [riscv64] #100 ibus-1.5.34-alt1.src.rpm: build start
2026-May-10 05:55:04 :: [riscv64] #100 ibus-1.5.34-alt1.src.rpm: build OK (cached)
2026-May-10 05:55:04 :: [riscv64] #200 libgtk4-4.22.4-alt1.src.rpm: build start
2026-May-10 05:58:09 :: [riscv64] #200 libgtk4-4.22.4-alt1.src.rpm: build OK (cached)
2026-May-10 05:58:09 :: [riscv64] #300 qjackctl-1.0.6-alt1.src.rpm: build start
2026-May-10 05:59:44 :: [riscv64] #300 qjackctl-1.0.6-alt1.src.rpm: build OK (cached)
riscv64/srpm/ibus-1.5.34-alt1.src.rpm: license not found in '/usr/share/license' directory: Unicode
riscv64/rpms/libibus-debuginfo-1.5.34-alt1.riscv64.rpm: license not found in '/usr/share/license' directory: Unicode
riscv64/rpms/libibus-1.5.34-alt1.riscv64.rpm: license not found in '/usr/share/license' directory: Unicode
riscv64/rpms/ibus-gtk2-1.5.34-alt1.riscv64.rpm: license not found in '/usr/share/license' directory: Unicode
riscv64/rpms/libibus-devel-docs-1.5.34-alt1.noarch.rpm: license not found in '/usr/share/license' directory: Unicode
riscv64/rpms/ibus-debuginfo-1.5.34-alt1.riscv64.rpm: license not found in '/usr/share/license' directory: Unicode
riscv64/rpms/ibus-gtk3-1.5.34-alt1.riscv64.rpm: license not found in '/usr/share/license' directory: Unicode
riscv64/rpms/ibus-1.5.34-alt1.riscv64.rpm: license not found in '/usr/share/license' directory: Unicode
riscv64/rpms/ibus-gtk3-debuginfo-1.5.34-alt1.riscv64.rpm: license not found in '/usr/share/license' directory: Unicode
riscv64/rpms/ibus-dicts-1.5.34-alt1.noarch.rpm: license not found in '/usr/share/license' directory: Unicode
riscv64/rpms/python3-module-ibus-overrides-1.5.34-alt1.riscv64.rpm: license not found in '/usr/share/license' directory: Unicode
riscv64/rpms/libibus-devel-1.5.34-alt1.riscv64.rpm: license not found in '/usr/share/license' directory: Unicode
riscv64/rpms/libibus-gir-1.5.34-alt1.riscv64.rpm: license not found in '/usr/share/license' directory: Unicode
riscv64/rpms/ibus-gtk2-debuginfo-1.5.34-alt1.riscv64.rpm: license not found in '/usr/share/license' directory: Unicode
riscv64/rpms/ibus-gtk4-1.5.34-alt1.riscv64.rpm: license not found in '/usr/share/license' directory: Unicode
riscv64/rpms/ibus-gtk4-debuginfo-1.5.34-alt1.riscv64.rpm: license not found in '/usr/share/license' directory: Unicode
riscv64/rpms/libibus-gir-devel-1.5.34-alt1.noarch.rpm: license not found in '/usr/share/license' directory: Unicode
2026-May-10 05:59:44 :: 100: build check OK (cached)
2026-May-10 05:59:44 :: 200: build check OK (cached)
2026-May-10 05:59:44 :: 300: build check OK (cached)
2026-May-10 05:59:45 :: build check OK
2026-May-10 05:59:45 :: #100: ibus-1.5.34-alt1.src.rpm: version check OK
2026-May-10 05:59:46 :: #200: libgtk4-4.22.4-alt1.src.rpm: version check OK
2026-May-10 05:59:46 :: #300: qjackctl-1.0.6-alt1.src.rpm: version check OK
2026-May-10 05:59:46 :: build version check OK
2026-May-10 05:59:46 :: noarch check OK
2026-May-10 05:59:47 :: plan: src +3 -3 =20906, noarch +6 -6 =21747, riscv64 +24 -24 =36925
#100 ibus 1.5.33-alt1 -> 1.5.34-alt1
 Thu Apr 30 2026 Yuri N. Sedunov <aris at altlinux.org> 1.5.34-alt1
 - 1.5.34
#200 libgtk4 4.22.3-alt1 -> 4.22.4-alt1
 Thu Apr 30 2026 Yuri N. Sedunov <aris at altlinux.org> 4.22.4-alt1
 - 4.22.4
#300 qjackctl 1.0.4-alt1 -> 1.0.6-alt1
 Thu Apr 30 2026 Yuri N. Sedunov <aris at altlinux.org> 1.0.6-alt1
 - 1.0.6
 Mon Feb 16 2026 Yuri N. Sedunov <aris at altlinux.org> 1.0.5-alt1
 - 1.0.5
2026-May-10 06:00:14 :: patched apt indices
2026-May-10 06:00:17 :: created next repo
2026-May-10 06:00:26 :: duplicate provides check OK
2026-May-10 06:00:51 :: dependencies check OK
2026-May-10 06:01:13 :: [riscv64] ELF symbols check OK
2026-May-10 06:02:28 :: [riscv64.0] #200 gtk4-demo: install check start
2026-May-10 06:02:28 :: [riscv64.1] #200 gtk4-update-icon-cache: install check start
2026-May-10 06:02:28 :: [riscv64.2] #100 ibus: install check start
2026-May-10 06:02:28 :: [riscv64.3] #100 ibus-dicts: install check start
2026-May-10 06:02:28 :: [riscv64.4] #100 ibus-gtk2: install check start
2026-May-10 06:02:28 :: [riscv64.5] #100 ibus-gtk3: install check start
2026-May-10 06:02:29 :: [riscv64.6] #100 ibus-gtk4: install check start
2026-May-10 06:02:29 :: [riscv64.7] #200 libgtk4: install check start
2026-May-10 06:03:25 :: [riscv64.1] #200 gtk4-update-icon-cache: install check OK (cached)
2026-May-10 06:03:25 :: [riscv64.1] #200 libgtk4-devel: install check start
	riscv64: ibus-dicts=1.5.34-alt1 post-install unowned files:
 /usr/share/ibus
2026-May-10 06:03:26 :: [riscv64.3] #100 ibus-dicts: install check OK (cached)
2026-May-10 06:03:26 :: [riscv64.3] #200 libgtk4-devel-doc: install check start
2026-May-10 06:03:28 :: [riscv64.4] #100 ibus-gtk2: install check OK (cached)
2026-May-10 06:03:28 :: [riscv64.5] #100 ibus-gtk3: install check OK (cached)
2026-May-10 06:03:28 :: [riscv64.4] #200 libgtk4-devel-doc-examples: install check start
2026-May-10 06:03:28 :: [riscv64.5] #200 libgtk4-gir: install check start
	riscv64: ibus=1.5.34-alt1 post-install unowned files:
 /etc/X11/xinit
 /etc/X11/xinit/xinput.d
 /etc/dconf/db/ibus
 /usr/lib/systemd/user/gnome-session.target.wants
 /usr/share/icons/hicolor/22x22
 /usr/share/icons/hicolor/22x22/apps
 /usr/share/icons/hicolor/24x24
 /usr/share/icons/hicolor/24x24/apps
 /usr/share/icons/hicolor/scalable
 /usr/share/icons/hicolor/scalable/apps
2026-May-10 06:03:29 :: [riscv64.2] #100 ibus: install check OK (cached)
	riscv64: ibus-gtk4=1.5.34-alt1 post-install unowned files:
 /usr/lib64/gtk-4.0/4.0.0/immodules
2026-May-10 06:03:29 :: [riscv64.6] #100 ibus-gtk4: install check OK (cached)
2026-May-10 06:03:30 :: [riscv64.2] #200 libgtk4-gir-devel: install check start
2026-May-10 06:03:30 :: [riscv64.6] #100 libibus: install check start
	riscv64: gtk4-demo=4.22.4-alt1 post-install unowned files:
 /usr/share/icons/hicolor/scalable
 /usr/share/icons/hicolor/scalable/apps
 /usr/share/icons/hicolor/symbolic
 /usr/share/icons/hicolor/symbolic/apps
2026-May-10 06:03:30 :: [riscv64.0] #200 gtk4-demo: install check OK (cached)
	riscv64: libgtk4=4.22.4-alt1 post-install unowned files:
 /usr/lib64/gtk-4.0
2026-May-10 06:03:31 :: [riscv64.7] #200 libgtk4: install check OK (cached)
2026-May-10 06:03:31 :: [riscv64.0] #100 libibus-devel: install check start
2026-May-10 06:03:31 :: [riscv64.7] #100 libibus-devel-docs: install check start
2026-May-10 06:03:57 :: [riscv64.3] #200 libgtk4-devel-doc: install check OK (cached)
2026-May-10 06:03:58 :: [riscv64.3] #100 libibus-gir: install check start
	riscv64: libgtk4-devel-doc-examples=4.22.4-alt1 post-install unowned files:
 /usr/share/doc/libgtk4-devel-4.22.4
2026-May-10 06:03:59 :: [riscv64.4] #200 libgtk4-devel-doc-examples: install check OK (cached)
2026-May-10 06:04:00 :: [riscv64.4] #100 libibus-gir-devel: install check start
2026-May-10 06:04:01 :: [riscv64.1] #200 libgtk4-devel: install check OK (cached)
2026-May-10 06:04:02 :: [riscv64.1] #100 python3-module-ibus-overrides: install check start
2026-May-10 06:04:02 :: [riscv64.6] #100 libibus: install check OK (cached)
2026-May-10 06:04:02 :: [riscv64.6] #300 qjackctl: install check start
2026-May-10 06:04:03 :: [riscv64.0] #100 libibus-devel: install check OK (cached)
2026-May-10 06:04:05 :: [riscv64.5] #200 libgtk4-gir: install check OK (cached)
	riscv64: libibus-devel-docs=1.5.34-alt1 post-install unowned files:
 /usr/share/gtk-doc
 /usr/share/gtk-doc/html
2026-May-10 06:04:08 :: [riscv64.7] #100 libibus-devel-docs: install check OK (cached)
2026-May-10 06:04:08 :: [riscv64.2] #200 libgtk4-gir-devel: install check OK (cached)
2026-May-10 06:04:29 :: [riscv64.3] #100 libibus-gir: install check OK (cached)
2026-May-10 06:04:31 :: [riscv64.4] #100 libibus-gir-devel: install check OK (cached)
2026-May-10 06:04:32 :: [riscv64.1] #100 python3-module-ibus-overrides: install check OK (cached)
Timeout, server 10.64.20.41 not responding.
ssh: connect to host 10.64.20.41 port 22: No route to host
2026-May-10 06:06:35 :: [riscv64.6] #300 qjackctl: install check FAILED
2026-May-10 06:06:35 :: [riscv64] requesting cancellation of task processing
ssh: connect to host 10.64.20.41 port 22: No route to host
rsync: connection unexpectedly closed (0 bytes received so far) [Receiver]
rsync error: unexplained error (code 255) at io.c(232) [Receiver=3.2.7]
ssh: connect to host 10.64.20.41 port 22: Connection timed out
rsync: connection unexpectedly closed (0 bytes received so far) [Receiver]
rsync error: unexplained error (code 255) at io.c(232) [Receiver=3.2.7]
ssh: connect to host 10.64.20.41 port 22: No route to host
rsync: connection unexpectedly closed (0 bytes received so far) [Receiver]
rsync error: unexplained error (code 255) at io.c(232) [Receiver=3.2.7]
ssh: connect to host 10.64.20.41 port 22: No route to host
rsync: connection unexpectedly closed (0 bytes received so far) [Receiver]
rsync error: unexplained error (code 255) at io.c(232) [Receiver=3.2.7]
ssh: connect to host 10.64.20.41 port 22: No route to host
rsync: connection unexpectedly closed (0 bytes received so far) [Receiver]
rsync error: unexplained error (code 255) at io.c(232) [Receiver=3.2.7]
ssh: connect to host 10.64.20.41 port 22: No route to host
rsync: connection unexpectedly closed (0 bytes received so far) [Receiver]
rsync error: unexplained error (code 255) at io.c(232) [Receiver=3.2.7]
ssh: connect to host 10.64.20.41 port 22: No route to host
rsync: connection unexpectedly closed (0 bytes received so far) [Receiver]
rsync error: unexplained error (code 255) at io.c(232) [Receiver=3.2.7]
ssh: connect to host 10.64.20.41 port 22: No route to host
rsync: connection unexpectedly closed (0 bytes received so far) [Receiver]
rsync error: unexplained error (code 255) at io.c(232) [Receiver=3.2.7]
ssh: connect to host 10.64.20.41 port 22: No route to host
rsync: connection unexpectedly closed (0 bytes received so far) [Receiver]
rsync error: unexplained error (code 255) at io.c(232) [Receiver=3.2.7]
ssh: connect to host 10.64.20.41 port 22: No route to host
rsync: connection unexpectedly closed (0 bytes received so far) [Receiver]
rsync error: unexplained error (code 255) at io.c(232) [Receiver=3.2.7]
ssh: connect to host 10.64.20.41 port 22: No route to host
rsync: connection unexpectedly closed (0 bytes received so far) [Receiver]
rsync error: unexplained error (code 255) at io.c(232) [Receiver=3.2.7]
ssh: connect to host 10.64.20.41 port 22: No route to host
rsync: connection unexpectedly closed (0 bytes received so far) [Receiver]
rsync error: unexplained error (code 255) at io.c(232) [Receiver=3.2.7]
ssh: connect to host 10.64.20.41 port 22: No route to host
rsync: connection unexpectedly closed (0 bytes received so far) [Receiver]
rsync error: unexplained error (code 255) at io.c(232) [Receiver=3.2.7]
ssh: connect to host 10.64.20.41 port 22: No route to host
rsync: connection unexpectedly closed (0 bytes received so far) [Receiver]
rsync error: unexplained error (code 255) at io.c(232) [Receiver=3.2.7]
ssh: connect to host 10.64.20.41 port 22: No route to host
rsync: connection unexpectedly closed (0 bytes received so far) [Receiver]
rsync error: unexplained error (code 255) at io.c(232) [Receiver=3.2.7]
ssh: connect to host 10.64.20.41 port 22: Connection timed out
rsync: connection unexpectedly closed (0 bytes received so far) [Receiver]
rsync error: unexplained error (code 255) at io.c(232) [Receiver=3.2.7]
ssh: connect to host 10.64.20.41 port 22: No route to host
rsync: connection unexpectedly closed (0 bytes received so far) [Receiver]
rsync error: unexplained error (code 255) at io.c(232) [Receiver=3.2.7]
ssh: connect to host 10.64.20.41 port 22: Connection timed out
rsync: connection unexpectedly closed (0 bytes received so far) [Receiver]
rsync error: unexplained error (code 255) at io.c(232) [Receiver=3.2.7]
ssh: connect to host 10.64.20.41 port 22: Connection timed out
rsync: connection unexpectedly closed (0 bytes received so far) [Receiver]
rsync error: unexplained error (code 255) at io.c(232) [Receiver=3.2.7]
ssh: connect to host 10.64.20.41 port 22: Connection timed out
rsync: connection unexpectedly closed (0 bytes received so far) [Receiver]
rsync error: unexplained error (code 255) at io.c(232) [Receiver=3.2.7]
ssh: connect to host 10.64.20.41 port 22: No route to host
rsync: connection unexpectedly closed (0 bytes received so far) [Receiver]
rsync error: unexplained error (code 255) at io.c(232) [Receiver=3.2.7]
ssh: connect to host 10.64.20.41 port 22: Connection timed out
rsync: connection unexpectedly closed (0 bytes received so far) [Receiver]
rsync error: unexplained error (code 255) at io.c(232) [Receiver=3.2.7]
ssh: connect to host 10.64.20.41 port 22: Connection timed out
rsync: connection unexpectedly closed (0 bytes received so far) [Receiver]
rsync error: unexplained error (code 255) at io.c(232) [Receiver=3.2.7]
ssh: connect to host 10.64.20.41 port 22: Connection timed out
rsync: connection unexpectedly closed (0 bytes received so far) [Receiver]
rsync error: unexplained error (code 255) at io.c(232) [Receiver=3.2.7]
ssh: connect to host 10.64.20.41 port 22: No route to host
rsync: connection unexpectedly closed (0 bytes received so far) [Receiver]
rsync error: unexplained error (code 255) at io.c(232) [Receiver=3.2.7]
ssh: connect to host 10.64.20.41 port 22: Connection timed out
rsync: connection unexpectedly closed (0 bytes received so far) [Receiver]
rsync error: unexplained error (code 255) at io.c(232) [Receiver=3.2.7]
2026-May-10 06:09:32 :: [riscv64] install check FAILED for: qjackctl
2026-May-10 06:09:32 :: [riscv64] install check FAILED
2026-May-10 06:09:32 :: task #121680 for sisyphus_riscv64 FAILED


More information about the Riscv-reports mailing list