[riscv-reports] [#121598] sisyphus_riscv64 FAILED srpm=osu-lazer-2026.429.0-alt1.src.rpm
Girar sisyphus_riscv64 awaiter recycler
noreply at basealt.ru
Sun May 10 02:29:34 MSK 2026
http://web.build.srt.basealt.ru/tasks/121598/logs/events.1.1.log
2026-May-09 23:26:14 :: shared task #121598 for sisyphus_riscv64 started by recycler:
2026-May-09 23:26:14 :: message: sync
#100 build osu-lazer-2026.429.0-alt1.src.rpm
2026-May-09 23:26:22 :: [riscv64] #100 osu-lazer-2026.429.0-alt1.src.rpm: build start
2026-May-09 23:29:31 :: [riscv64] #100 osu-lazer-2026.429.0-alt1.src.rpm: build SKIPPED
2026-May-09 23:29:33 :: #100: osu-lazer-2026.429.0-alt1.src.rpm: no source package
2026-May-09 23:29:33 :: build check FAILED for: #100
2026-May-09 23:29:33 :: task #121598 for sisyphus_riscv64 FAILED
More information about the Riscv-reports
mailing list