[riscv-reports] [#121197] sisyphus_riscv64 FAILED (try 2) srpm=libxmlsec1-1.3.11-alt1.src.rpm srpm=aqbanking-6.4.1-alt1.src.rpm ...

Girar sisyphus_riscv64 awaiter recycler noreply at basealt.ru
Sat May 9 16:39:12 MSK 2026


http://web.build.srt.basealt.ru/tasks/121197/logs/events.2.1.log

subtask  name                              riscv64
   #400  libreoffice                       3:42:00
   #500  oath-toolkit                        11:40
   #700  openscap                             6:19
  #1000  python3-module-dm.xmlsec.binding     3:49
  #1100  python3-module-xmlsec                3:19

2026-May-09 09:29:53 :: shared task #121197 for sisyphus_riscv64 resumed by recycler:
2026-May-09 09:29:53 :: message: sync
#100 build libxmlsec1-1.3.11-alt1.src.rpm
#200 build aqbanking-6.4.1-alt1.src.rpm
#300 build lasso-2.9.0-alt1.src.rpm
#400 build libreoffice-26.2.2.2-alt5.src.rpm
#500 build oath-toolkit-2.6.14-alt1.src.rpm
#600 build open-vm-tools-13.0.10-alt1.src.rpm
#700 build openscap-1.4.3-alt1.src.rpm
#1000 build python3-module-dm.xmlsec.binding-3.0-alt1.src.rpm
#1100 build python3-module-xmlsec-1.3.17-alt3.src.rpm
2026-May-09 09:29:53 :: created build repo
2026-May-09 09:30:06 :: [riscv64] #100 libxmlsec1-1.3.11-alt1.src.rpm: build start
2026-May-09 09:30:08 :: [riscv64] #100 libxmlsec1-1.3.11-alt1.src.rpm: build swiftly SKIPPED
2026-May-09 09:30:08 :: [riscv64] #200 aqbanking-6.4.1-alt1.src.rpm: build start
2026-May-09 09:30:11 :: [riscv64] #200 aqbanking-6.4.1-alt1.src.rpm: build swiftly SKIPPED
2026-May-09 09:30:11 :: [riscv64] #300 lasso-2.9.0-alt1.src.rpm: build start
2026-May-09 09:30:14 :: [riscv64] #300 lasso-2.9.0-alt1.src.rpm: build swiftly SKIPPED
2026-May-09 09:30:14 :: [riscv64] #400 libreoffice-26.2.2.2-alt5.src.rpm: build start
2026-May-09 13:12:14 :: [riscv64] #400 libreoffice-26.2.2.2-alt5.src.rpm: build OK
2026-May-09 13:12:14 :: [riscv64] #500 oath-toolkit-2.6.14-alt1.src.rpm: build start
2026-May-09 13:23:54 :: [riscv64] #500 oath-toolkit-2.6.14-alt1.src.rpm: build OK
2026-May-09 13:23:54 :: [riscv64] #600 open-vm-tools-13.0.10-alt1.src.rpm: build start
2026-May-09 13:25:16 :: [riscv64] #600 open-vm-tools-13.0.10-alt1.src.rpm: build SKIPPED
2026-May-09 13:25:16 :: [riscv64] #700 openscap-1.4.3-alt1.src.rpm: build start
2026-May-09 13:31:35 :: [riscv64] #700 openscap-1.4.3-alt1.src.rpm: build OK
2026-May-09 13:31:35 :: [riscv64] #1000 python3-module-dm.xmlsec.binding-3.0-alt1.src.rpm: build start
2026-May-09 13:35:24 :: [riscv64] #1000 python3-module-dm.xmlsec.binding-3.0-alt1.src.rpm: build OK
2026-May-09 13:35:24 :: [riscv64] #1100 python3-module-xmlsec-1.3.17-alt3.src.rpm: build start
2026-May-09 13:38:43 :: [riscv64] #1100 python3-module-xmlsec-1.3.17-alt3.src.rpm: build OK
2026-May-09 13:38:46 :: 100: build check OK
2026-May-09 13:38:47 :: 200: build check OK
2026-May-09 13:38:48 :: 300: build check OK
2026-May-09 13:39:06 :: 400: build check OK
2026-May-09 13:39:08 :: 500: build check OK
2026-May-09 13:39:08 :: #600: open-vm-tools-13.0.10-alt1.src.rpm: no source package
2026-May-09 13:39:10 :: 700: build check OK
2026-May-09 13:39:11 :: 1000: build check OK
2026-May-09 13:39:12 :: 1100: build check OK
2026-May-09 13:39:12 :: build check FAILED for: #600 
2026-May-09 13:39:12 :: task #121197 for sisyphus_riscv64 FAILED


More information about the Riscv-reports mailing list