[riscv-reports] [#120844] sisyphus_riscv64 FAILED srpm=pve-common-9.1.6-alt2.src.rpm

Girar sisyphus_riscv64 awaiter recycler noreply at basealt.ru
Sat May 9 04:49:03 MSK 2026


http://web.build.srt.basealt.ru/tasks/120844/logs/events.1.1.log

2026-May-09 01:47:59 :: shared task #120844 for sisyphus_riscv64 started by recycler:
2026-May-09 01:47:59 :: message: sync
#100 build pve-common-9.1.6-alt2.src.rpm
2026-May-09 01:48:07 :: [riscv64] #100 pve-common-9.1.6-alt2.src.rpm: build start
2026-May-09 01:49:03 :: [riscv64] #100 pve-common-9.1.6-alt2.src.rpm: build SKIPPED
2026-May-09 01:49:03 :: #100: pve-common-9.1.6-alt2.src.rpm: no source package
2026-May-09 01:49:03 :: build check FAILED for: #100 
2026-May-09 01:49:03 :: task #120844 for sisyphus_riscv64 FAILED


More information about the Riscv-reports mailing list