[riscv-reports] [#120836] sisyphus_riscv64 FAILED srpm=skim-4.6.1-alt1.src.rpm

Girar sisyphus_riscv64 awaiter recycler noreply at basealt.ru
Sat May 9 04:36:49 MSK 2026


http://web.build.srt.basealt.ru/tasks/120836/logs/events.1.1.log

2026-May-09 01:35:16 :: shared task #120836 for sisyphus_riscv64 started by recycler:
2026-May-09 01:35:16 :: message: sync
#100 build skim-4.6.1-alt1.src.rpm
2026-May-09 01:35:21 :: [riscv64] #100 skim-4.6.1-alt1.src.rpm: build start
2026-May-09 01:36:49 :: [riscv64] #100 skim-4.6.1-alt1.src.rpm: build SKIPPED
2026-May-09 01:36:49 :: #100: skim-4.6.1-alt1.src.rpm: no source package
2026-May-09 01:36:49 :: build check FAILED for: #100 
2026-May-09 01:36:49 :: task #120836 for sisyphus_riscv64 FAILED


More information about the Riscv-reports mailing list