[riscv-reports] [#120728] sisyphus_riscv64 FAILED srpm=talos-1.12.7-alt1.src.rpm
Girar sisyphus_riscv64 awaiter recycler
noreply at basealt.ru
Fri May 8 21:32:03 MSK 2026
http://web.build.srt.basealt.ru/tasks/120728/logs/events.1.1.log
2026-May-08 18:30:45 :: shared task #120728 for sisyphus_riscv64 started by recycler:
2026-May-08 18:30:45 :: message: sync
#100 build talos-1.12.7-alt1.src.rpm
2026-May-08 18:30:51 :: [riscv64] #100 talos-1.12.7-alt1.src.rpm: build start
2026-May-08 18:32:02 :: [riscv64] #100 talos-1.12.7-alt1.src.rpm: build SKIPPED
2026-May-08 18:32:02 :: #100: talos-1.12.7-alt1.src.rpm: no source package
2026-May-08 18:32:03 :: build check FAILED for: #100
2026-May-08 18:32:03 :: task #120728 for sisyphus_riscv64 FAILED
More information about the Riscv-reports
mailing list