[riscv-reports] [#120396] sisyphus_riscv64 FAILED (try 3) srpm=python3-module-jupyter_cache-1.0.1-alt1.src.rpm ...

Girar sisyphus_riscv64 awaiter recycler noreply at basealt.ru
Fri May 8 18:58:16 MSK 2026


http://web.build.srt.basealt.ru/tasks/120396/logs/events.3.1.log

subtask  name  riscv64
  #3500  vtk   9:03:43

2026-May-08 06:47:50 :: shared task #120396 for sisyphus_riscv64 resumed by recycler:
2026-May-08 06:47:50 :: message: sync
#100 build python3-module-jupyter_cache-1.0.1-alt1.src.rpm
#200 build python3-module-myst_nb-1.4.0-alt1.src.rpm
#300 build python3-module-pybtex-0.25.0-alt1.src.rpm
#400 build python3-module-pybtex_docutils-1.0.3-alt1.src.rpm
#500 build python3-module-sphinxcontrib-bibtex-2.6.5-alt1.src.rpm
#600 build gdal-3.12.2-alt1.src.rpm
#700 build pdal-2.9.3-alt1.src.rpm
#1000 build mysql-workbench-community-8.0.47-alt2.src.rpm
#1100 build grass-8.4.2-alt2.src.rpm
#1200 build python3-module-rasterio-1.5.0-alt1.src.rpm
#1300 build merkaartor-0.20.0-alt1.src.rpm
#1400 build GMT-6.4.0-alt1_11.src.rpm
#1500 removed
#1600 build qmapshack-1.17.1-alt1.1.src.rpm
#1700 build osgearth-3.8-alt1.src.rpm
#2000 build openmw-0.50.0-alt1.src.rpm
#2100 build python3-module-glymur-0.14.7-alt1.src.rpm
#2200 build OpenSceneGraph-3.6.5-alt5.src.rpm
#2300 build mapserver-8.4.0-alt1.src.rpm
#2400 build octave-mapping-1.4.2-alt1.src.rpm
#2500 build openorienteering-mapper-0.9.5-alt7.src.rpm
#2600 build postgresql14-postgis-3.6.2-alt1.src.rpm
#2700 build postgresql15-postgis-3.6.2-alt1.src.rpm
#3000 build postgresql16-postgis-3.6.2-alt1.src.rpm
#3100 build postgresql17-postgis-3.6.2-alt1.src.rpm
#3200 build postgresql18-postgis-3.6.2-alt1.src.rpm
#3300 build python3-module-fiona-1.10.1-alt1.src.rpm
#3400 removed
#3500 build vtk-9.5.2-alt2.src.rpm
2026-May-08 06:47:50 :: created build repo
2026-May-08 06:47:59 :: [riscv64] #100 python3-module-jupyter_cache-1.0.1-alt1.src.rpm: build start
2026-May-08 06:48:01 :: [riscv64] #100 python3-module-jupyter_cache-1.0.1-alt1.src.rpm: build swiftly SKIPPED
2026-May-08 06:48:01 :: [riscv64] #200 python3-module-myst_nb-1.4.0-alt1.src.rpm: build start
2026-May-08 06:48:03 :: [riscv64] #200 python3-module-myst_nb-1.4.0-alt1.src.rpm: build swiftly SKIPPED
2026-May-08 06:48:03 :: [riscv64] #300 python3-module-pybtex-0.25.0-alt1.src.rpm: build start
2026-May-08 06:48:05 :: [riscv64] #300 python3-module-pybtex-0.25.0-alt1.src.rpm: build swiftly SKIPPED
2026-May-08 06:48:05 :: [riscv64] #400 python3-module-pybtex_docutils-1.0.3-alt1.src.rpm: build start
2026-May-08 06:48:07 :: [riscv64] #400 python3-module-pybtex_docutils-1.0.3-alt1.src.rpm: build swiftly SKIPPED
2026-May-08 06:48:07 :: [riscv64] #500 python3-module-sphinxcontrib-bibtex-2.6.5-alt1.src.rpm: build start
2026-May-08 06:48:10 :: [riscv64] #500 python3-module-sphinxcontrib-bibtex-2.6.5-alt1.src.rpm: build swiftly SKIPPED
2026-May-08 06:48:10 :: [riscv64] #600 gdal-3.12.2-alt1.src.rpm: build start
2026-May-08 06:48:15 :: [riscv64] #600 gdal-3.12.2-alt1.src.rpm: build swiftly SKIPPED
2026-May-08 06:48:15 :: [riscv64] #700 pdal-2.9.3-alt1.src.rpm: build start
2026-May-08 06:48:22 :: [riscv64] #700 pdal-2.9.3-alt1.src.rpm: build swiftly SKIPPED
2026-May-08 06:48:22 :: [riscv64] #1000 mysql-workbench-community-8.0.47-alt2.src.rpm: build start
2026-May-08 06:48:29 :: [riscv64] #1000 mysql-workbench-community-8.0.47-alt2.src.rpm: build swiftly SKIPPED
2026-May-08 06:48:29 :: [riscv64] #1100 grass-8.4.2-alt2.src.rpm: build start
2026-May-08 06:48:34 :: [riscv64] #1100 grass-8.4.2-alt2.src.rpm: build swiftly SKIPPED
2026-May-08 06:48:34 :: [riscv64] #1200 python3-module-rasterio-1.5.0-alt1.src.rpm: build start
2026-May-08 06:48:37 :: [riscv64] #1200 python3-module-rasterio-1.5.0-alt1.src.rpm: build swiftly SKIPPED
2026-May-08 06:48:37 :: [riscv64] #1300 merkaartor-0.20.0-alt1.src.rpm: build start
2026-May-08 06:48:40 :: [riscv64] #1300 merkaartor-0.20.0-alt1.src.rpm: build swiftly SKIPPED
2026-May-08 06:48:40 :: [riscv64] #1400 GMT-6.4.0-alt1_11.src.rpm: build start
2026-May-08 06:48:46 :: [riscv64] #1400 GMT-6.4.0-alt1_11.src.rpm: build swiftly SKIPPED
2026-May-08 06:48:46 :: [riscv64] #1600 qmapshack-1.17.1-alt1.1.src.rpm: build start
2026-May-08 06:50:55 :: [riscv64] #1600 qmapshack-1.17.1-alt1.1.src.rpm: build SKIPPED
2026-May-08 06:50:55 :: [riscv64] #1700 osgearth-3.8-alt1.src.rpm: build start
2026-May-08 06:51:05 :: [riscv64] #1700 osgearth-3.8-alt1.src.rpm: build swiftly SKIPPED
2026-May-08 06:51:05 :: [riscv64] #2000 openmw-0.50.0-alt1.src.rpm: build start
2026-May-08 06:52:47 :: [riscv64] #2000 openmw-0.50.0-alt1.src.rpm: build SKIPPED
2026-May-08 06:52:47 :: [riscv64] #2100 python3-module-glymur-0.14.7-alt1.src.rpm: build start
2026-May-08 06:52:50 :: [riscv64] #2100 python3-module-glymur-0.14.7-alt1.src.rpm: build swiftly SKIPPED
2026-May-08 06:52:50 :: [riscv64] #2200 OpenSceneGraph-3.6.5-alt5.src.rpm: build start
2026-May-08 06:52:56 :: [riscv64] #2200 OpenSceneGraph-3.6.5-alt5.src.rpm: build swiftly SKIPPED
2026-May-08 06:52:56 :: [riscv64] #2300 mapserver-8.4.0-alt1.src.rpm: build start
2026-May-08 06:52:59 :: [riscv64] #2300 mapserver-8.4.0-alt1.src.rpm: build swiftly SKIPPED
2026-May-08 06:52:59 :: [riscv64] #2400 octave-mapping-1.4.2-alt1.src.rpm: build start
2026-May-08 06:53:01 :: [riscv64] #2400 octave-mapping-1.4.2-alt1.src.rpm: build swiftly SKIPPED
2026-May-08 06:53:02 :: [riscv64] #2500 openorienteering-mapper-0.9.5-alt7.src.rpm: build start
2026-May-08 06:53:05 :: [riscv64] #2500 openorienteering-mapper-0.9.5-alt7.src.rpm: build swiftly SKIPPED
2026-May-08 06:53:05 :: [riscv64] #2600 postgresql14-postgis-3.6.2-alt1.src.rpm: build start
2026-May-08 06:53:08 :: [riscv64] #2600 postgresql14-postgis-3.6.2-alt1.src.rpm: build swiftly SKIPPED
2026-May-08 06:53:08 :: [riscv64] #2700 postgresql15-postgis-3.6.2-alt1.src.rpm: build start
2026-May-08 06:53:12 :: [riscv64] #2700 postgresql15-postgis-3.6.2-alt1.src.rpm: build swiftly SKIPPED
2026-May-08 06:53:12 :: [riscv64] #3000 postgresql16-postgis-3.6.2-alt1.src.rpm: build start
2026-May-08 06:53:16 :: [riscv64] #3000 postgresql16-postgis-3.6.2-alt1.src.rpm: build swiftly SKIPPED
2026-May-08 06:53:16 :: [riscv64] #3100 postgresql17-postgis-3.6.2-alt1.src.rpm: build start
2026-May-08 06:53:20 :: [riscv64] #3100 postgresql17-postgis-3.6.2-alt1.src.rpm: build swiftly SKIPPED
2026-May-08 06:53:20 :: [riscv64] #3200 postgresql18-postgis-3.6.2-alt1.src.rpm: build start
2026-May-08 06:53:23 :: [riscv64] #3200 postgresql18-postgis-3.6.2-alt1.src.rpm: build swiftly SKIPPED
2026-May-08 06:53:23 :: [riscv64] #3300 python3-module-fiona-1.10.1-alt1.src.rpm: build start
2026-May-08 06:53:26 :: [riscv64] #3300 python3-module-fiona-1.10.1-alt1.src.rpm: build swiftly SKIPPED
2026-May-08 06:53:26 :: [riscv64] #3500 vtk-9.5.2-alt2.src.rpm: build start
2026-May-08 15:57:09 :: [riscv64] #3500 vtk-9.5.2-alt2.src.rpm: build OK
2026-May-08 15:57:10 :: 100: build check OK
2026-May-08 15:57:10 :: 200: build check OK
2026-May-08 15:57:11 :: 300: build check OK
2026-May-08 15:57:11 :: 400: build check OK
2026-May-08 15:57:11 :: 500: build check OK
2026-May-08 15:57:13 :: 600: build check OK
2026-May-08 15:57:15 :: 700: build check OK
riscv64/rpms/mysql-workbench-community-data-8.0.47-alt2.noarch.rpm: license not found in '/usr/share/license' directory: Scintilla
riscv64/rpms/mysql-workbench-community-data-8.0.47-alt2.noarch.rpm: license not found in '/usr/share/license' directory: Public-Domain
2026-May-08 15:57:16 :: 1000: build check OK
2026-May-08 15:57:17 :: 1100: build check OK
2026-May-08 15:57:18 :: 1200: build check OK
2026-May-08 15:57:19 :: 1300: build check OK
2026-May-08 15:57:20 :: 1400: build check OK
2026-May-08 15:57:20 :: #1600: qmapshack-1.17.1-alt1.1.src.rpm: no source package
riscv64/srpm/osgearth-3.8-alt1.src.rpm: exception not found in '/usr/share/license-exception' directory: exceptions
riscv64/rpms/osgearth-examples-debuginfo-3.8-alt1.riscv64.rpm: exception not found in '/usr/share/license-exception' directory: exceptions
riscv64/rpms/libosgearth-3.8-alt1.riscv64.rpm: exception not found in '/usr/share/license-exception' directory: exceptions
riscv64/rpms/libosgearth-devel-3.8-alt1.riscv64.rpm: exception not found in '/usr/share/license-exception' directory: exceptions
riscv64/rpms/libosgearth-debuginfo-3.8-alt1.riscv64.rpm: exception not found in '/usr/share/license-exception' directory: exceptions
riscv64/rpms/osgearth-data-3.8-alt1.noarch.rpm: exception not found in '/usr/share/license-exception' directory: exceptions
riscv64/rpms/osgearth-examples-3.8-alt1.riscv64.rpm: exception not found in '/usr/share/license-exception' directory: exceptions
2026-May-08 15:57:22 :: 1700: build check OK
2026-May-08 15:57:22 :: #2000: openmw-0.50.0-alt1.src.rpm: no source package
2026-May-08 15:57:22 :: 2100: build check OK
2026-May-08 15:57:30 :: 2200: build check OK
2026-May-08 15:57:31 :: 2300: build check OK
2026-May-08 15:57:32 :: 2400: build check OK
2026-May-08 15:57:32 :: 2500: build check OK
2026-May-08 15:57:33 :: 2600: build check OK
2026-May-08 15:57:34 :: 2700: build check OK
2026-May-08 15:57:34 :: 3000: build check OK
2026-May-08 15:57:35 :: 3100: build check OK
2026-May-08 15:57:36 :: 3200: build check OK
2026-May-08 15:57:36 :: 3300: build check OK
2026-May-08 15:58:16 :: 3500: build check OK
2026-May-08 15:58:16 :: build check FAILED for: #1600 #2000 
2026-May-08 15:58:16 :: task #120396 for sisyphus_riscv64 FAILED


More information about the Riscv-reports mailing list