[riscv-reports] [#120613] sisyphus_riscv64 FAILED srpm=sbsigntools-0.9.5-alt4.src.rpm
Girar sisyphus_riscv64 awaiter recycler
noreply at basealt.ru
Fri May 8 10:47:53 MSK 2026
http://web.build.srt.basealt.ru/tasks/120613/logs/events.1.1.log
subtask name riscv64
#100 sbsigntools failed
2026-May-08 07:45:54 :: shared task #120613 for sisyphus_riscv64 started by recycler:
2026-May-08 07:45:54 :: message: sync
#100 build sbsigntools-0.9.5-alt4.src.rpm
2026-May-08 07:46:01 :: [riscv64] #100 sbsigntools-0.9.5-alt4.src.rpm: build start
[riscv64] make[3]: Entering directory '/usr/src/RPM/BUILD/sbsigntools-0.9.5/tests'
[riscv64] FAIL: sign-verify.sh
[riscv64] make[3]: Leaving directory '/usr/src/RPM/BUILD/sbsigntools-0.9.5/tests'
[riscv64] make[3]: Entering directory '/usr/src/RPM/BUILD/sbsigntools-0.9.5/tests'
[riscv64] FAIL: sign-verify-detached.sh
[riscv64] make[3]: Leaving directory '/usr/src/RPM/BUILD/sbsigntools-0.9.5/tests'
[riscv64] make[3]: Entering directory '/usr/src/RPM/BUILD/sbsigntools-0.9.5/tests'
[riscv64] FAIL: sign-detach-verify.sh
[riscv64] make[3]: Leaving directory '/usr/src/RPM/BUILD/sbsigntools-0.9.5/tests'
[riscv64] make[3]: Entering directory '/usr/src/RPM/BUILD/sbsigntools-0.9.5/tests'
[riscv64] FAIL: sign-attach-verify.sh
[riscv64] make[3]: Leaving directory '/usr/src/RPM/BUILD/sbsigntools-0.9.5/tests'
[riscv64] make[3]: Entering directory '/usr/src/RPM/BUILD/sbsigntools-0.9.5/tests'
[riscv64] FAIL: verify-missing-cert.sh
[riscv64] make[3]: Leaving directory '/usr/src/RPM/BUILD/sbsigntools-0.9.5/tests'
[riscv64] make[3]: Entering directory '/usr/src/RPM/BUILD/sbsigntools-0.9.5/tests'
[riscv64] FAIL: resign-warning.sh
[riscv64] make[3]: Leaving directory '/usr/src/RPM/BUILD/sbsigntools-0.9.5/tests'
[riscv64] make[3]: Entering directory '/usr/src/RPM/BUILD/sbsigntools-0.9.5/tests'
[riscv64] FAIL: reattach-warning.sh
[riscv64] make[3]: Leaving directory '/usr/src/RPM/BUILD/sbsigntools-0.9.5/tests'
[riscv64] --
[riscv64] # SKIP: 0
[riscv64] # XFAIL: 0
[riscv64] # FAIL: 7
[riscv64] # XPASS: 0
[riscv64] # ERROR: 0
[riscv64] See tests/test-suite.log
2026-May-08 07:47:52 :: [riscv64] sbsigntools-0.9.5-alt4.src.rpm: remote: build failed
2026-May-08 07:47:52 :: [riscv64] #100 sbsigntools-0.9.5-alt4.src.rpm: build FAILED
2026-May-08 07:47:52 :: [riscv64] requesting cancellation of task processing
2026-May-08 07:47:53 :: [riscv64] build FAILED
2026-May-08 07:47:53 :: task #120613 for sisyphus_riscv64 FAILED
More information about the Riscv-reports
mailing list