[riscv-reports] [#120596] sisyphus_riscv64 FAILED srpm=libpeas-1.38.1-alt1.1.src.rpm srpm=libpeas2-2.2.1-alt1.1.src.rpm
Girar sisyphus_riscv64 awaiter recycler
noreply at basealt.ru
Fri May 8 09:28:07 MSK 2026
http://web.build.srt.basealt.ru/tasks/120596/logs/events.1.1.log
subtask name riscv64
#100 libpeas 6:38
#200 libpeas2 5:25
2026-May-08 06:11:15 :: shared task #120596 for sisyphus_riscv64 started by recycler:
2026-May-08 06:11:15 :: message: sync
#100 build libpeas-1.38.1-alt1.1.src.rpm
#200 build libpeas2-2.2.1-alt1.1.src.rpm
2026-May-08 06:11:15 :: created build repo
2026-May-08 06:11:23 :: [riscv64] #100 libpeas-1.38.1-alt1.1.src.rpm: build start
2026-May-08 06:18:01 :: [riscv64] #100 libpeas-1.38.1-alt1.1.src.rpm: build OK
2026-May-08 06:18:02 :: [riscv64] #200 libpeas2-2.2.1-alt1.1.src.rpm: build start
2026-May-08 06:23:27 :: [riscv64] #200 libpeas2-2.2.1-alt1.1.src.rpm: build OK
2026-May-08 06:23:29 :: 100: build check OK
2026-May-08 06:23:31 :: 200: build check OK
2026-May-08 06:23:31 :: build check OK
2026-May-08 06:23:31 :: #100: libpeas-1.38.1-alt1.1.src.rpm: version check OK
2026-May-08 06:23:32 :: #200: libpeas2-2.2.1-alt1.1.src.rpm: version check OK
2026-May-08 06:23:32 :: build version check OK
2026-May-08 06:23:32 :: noarch check OK
2026-May-08 06:23:33 :: plan: src +2 -2 =20882, noarch +4 -4 =21700, riscv64 +16 -16 =36923
#100 libpeas 1.38.1-alt0.port -> 1.38.1-alt1.1
Sat Apr 25 2026 Yuri N. Sedunov <aris at altlinux.org> 1.38.1-alt1.1
- fixed tests for pygobject >= 3.55.3
#200 libpeas2 2.2.0-alt1 -> 2.2.1-alt1.1
Sat Apr 25 2026 Yuri N. Sedunov <aris at altlinux.org> 2.2.1-alt1.1
- fixed tests for pygobject >= 3.55.3
Wed Feb 25 2026 Yuri N. Sedunov <aris at altlinux.org> 2.2.1-alt1
- 2.2.1
2026-May-08 06:23:57 :: patched apt indices
2026-May-08 06:24:00 :: created next repo
2026-May-08 06:24:09 :: duplicate provides check OK
2026-May-08 06:24:33 :: dependencies check OK
2026-May-08 06:24:54 :: [riscv64] ELF symbols check OK
2026-May-08 06:25:15 :: [riscv64.0] #100 libpeas: install check start
2026-May-08 06:25:15 :: [riscv64.1] #100 libpeas-demo: install check start
2026-May-08 06:25:15 :: [riscv64.2] #100 libpeas-devel: install check start
2026-May-08 06:25:15 :: [riscv64.3] #100 libpeas-devel-doc: install check start
2026-May-08 06:25:15 :: [riscv64.4] #100 libpeas-gir: install check start
2026-May-08 06:25:15 :: [riscv64.5] #100 libpeas-gir-devel: install check start
2026-May-08 06:25:15 :: [riscv64.6] #100 libpeas-python3-loader: install check start
2026-May-08 06:25:15 :: [riscv64.7] #200 libpeas2: install check start
2026-May-08 06:26:27 :: [riscv64.3] #100 libpeas-devel-doc: install check OK
2026-May-08 06:26:27 :: [riscv64.3] #200 libpeas2-devel: install check start
riscv64: libpeas2=2.2.1-alt1.1 post-install unowned files:
/usr/lib64/libpeas-2
2026-May-08 06:26:30 :: [riscv64.7] #200 libpeas2: install check OK
2026-May-08 06:26:31 :: [riscv64.7] #200 libpeas2-devel-doc: install check start
riscv64: libpeas=1.38.1-alt1.1 post-install unowned files:
/usr/lib64/libpeas-1.0
/usr/share/icons/hicolor/16x16/actions
/usr/share/icons/hicolor/22x22
/usr/share/icons/hicolor/22x22/actions
/usr/share/icons/hicolor/32x32/actions
/usr/share/icons/hicolor/scalable
/usr/share/icons/hicolor/scalable/actions
2026-May-08 06:26:43 :: [riscv64.0] #100 libpeas: install check OK
2026-May-08 06:26:43 :: [riscv64.0] #200 libpeas2-gir: install check start
2026-May-08 06:26:45 :: [riscv64.4] #100 libpeas-gir: install check OK
2026-May-08 06:26:45 :: [riscv64.4] #200 libpeas2-gir-devel: install check start
2026-May-08 06:26:47 :: [riscv64.6] #100 libpeas-python3-loader: install check OK
2026-May-08 06:26:47 :: [riscv64.6] #200 libpeas2-gjs-loader: install check start
2026-May-08 06:27:08 :: [riscv64.2] #100 libpeas-devel: install check OK
2026-May-08 06:27:08 :: [riscv64.2] #200 libpeas2-python3-loader: install check start
2026-May-08 06:27:15 :: [riscv64.1] #100 libpeas-demo: install check OK
2026-May-08 06:27:16 :: [riscv64.7] #200 libpeas2-devel-doc: install check OK
2026-May-08 06:27:20 :: [riscv64.5] #100 libpeas-gir-devel: install check OK
2026-May-08 06:27:27 :: [riscv64.3] #200 libpeas2-devel: install check OK
2026-May-08 06:27:31 :: [riscv64.0] #200 libpeas2-gir: install check OK
2026-May-08 06:27:41 :: [riscv64.6] #200 libpeas2-gjs-loader: install check OK
2026-May-08 06:27:42 :: [riscv64.4] #200 libpeas2-gir-devel: install check OK
2026-May-08 06:28:04 :: [riscv64.2] #200 libpeas2-python3-loader: install check OK
error: #100: /gears/l/libpeas.git branch `sisyphus_riscv64' already exists, package update by srpm upload is not possible
2026-May-08 06:28:07 :: gears inheritance check FAILED for: #100
2026-May-08 06:28:07 :: task #120596 for sisyphus_riscv64 FAILED
More information about the Riscv-reports
mailing list