[riscv-reports] [#120598] sisyphus_riscv64 FAILED srpm=gdal-3.12.4-alt1.src.rpm
Girar sisyphus_riscv64 awaiter recycler
noreply at basealt.ru
Fri May 8 09:17:42 MSK 2026
http://web.build.srt.basealt.ru/tasks/120598/logs/events.1.1.log
subtask name riscv64
#100 gdal failed
2026-May-08 06:16:09 :: shared task #120598 for sisyphus_riscv64 started by recycler:
2026-May-08 06:16:09 :: message: sync
#100 build gdal-3.12.4-alt1.src.rpm
2026-May-08 06:16:17 :: [riscv64] #100 gdal-3.12.4-alt1.src.rpm: build start
[riscv64] <13>May 8 06:17:30 rpmi: libsqlite3-3.50.4-alt1 sisyphus_riscv64+91443.100.1.1 1754555936 installed
[riscv64] <13>May 8 06:17:30 rpmi: libmpdec3-2.5.1-alt3 sisyphus_riscv64+29035.100.1.1 1675621702 installed
[riscv64] <13>May 8 06:17:30 rpmi: libexpat-2.7.4-alt1 sisyphus_riscv64+109313.100.1.1 1770323898 installed
[riscv64] <13>May 8 06:17:30 rpmi: openssl-config-3.5.0-alt1 sisyphus_riscv64+99925.100.1.1 1762587030 installed
[riscv64] <13>May 8 06:17:30 rpmi: libb2-0.98.1-alt1_1 sisyphus_riscv64+13721.100.1.1 1638969645 installed
[riscv64] <13>May 8 06:17:30 rpmi: libp11-kit-1:0.25.10-alt2 sisyphus_riscv64+102359.300.1.2 1764647411 installed
[riscv64] <13>May 8 06:17:30 rpmi: libtasn1-4.21.0-alt1 sisyphus_riscv64+110145.100.1.1 1770759719 installed
[riscv64] <13>May 8 06:17:30 rpmi: rpm-macros-alternatives-0.5.3-alt1 sisyphus_riscv64+71244.100.1.1 1738025117 installed
[riscv64] <13>May 8 06:17:30 rpmi: alternatives-0.5.3-alt1 sisyphus_riscv64+71244.100.1.1 1738025117 installed
[riscv64] <13>May 8 06:17:31 rpmi: ca-certificates-2026.02.25-alt1 sisyphus_riscv64+111964.200.1.1 1772057912 installed
[riscv64] <13>May 8 06:17:31 rpmi: ca-trust-0.2.0-alt1 sisyphus_riscv64+47419.100.1.1 1712764300 installed
[riscv64] <13>May 8 06:17:31 rpmi: p11-kit-trust-1:0.25.10-alt2 sisyphus_riscv64+102359.300.1.2 1764647411 installed
[riscv64] <13>May 8 06:17:31 rpmi: libcrypto3-3.5.4-alt1 sisyphus_riscv64+99925.200.1.1 1762591620 installed
[riscv64] <13>May 8 06:17:31 rpmi: libssl3-3.5.4-alt1 sisyphus_riscv64+99925.200.1.1 1762591620 installed
[riscv64] <13>May 8 06:17:31 rpmi: python3-modules-sqlite3-3.13.12-alt3 sisyphus_riscv64+119616.100.1.1 1776677221 installed
[riscv64] <13>May 8 06:17:31 rpmi: python3-3.13.12-alt3 sisyphus_riscv64+119616.100.1.1 1776677221 installed
[riscv64] <13>May 8 06:17:33 rpmi: python3-base-3.13.12-alt3 sisyphus_riscv64+119616.100.1.1 1776677221 installed
[riscv64] <13>May 8 06:17:33 rpmi: python3-module-py3dephell-0.3.1-alt1 sisyphus_riscv64+67758.200.1.1 1734524951 installed
[riscv64] <13>May 8 06:17:33 rpmi: tests-for-installed-python3-pkgs-0.1.29-alt1 sisyphus_riscv64+100285.100.1.1 1762815565 installed
[riscv64] <13>May 8 06:17:33 rpmi: rpm-build-python3-0.1.29-alt1 sisyphus_riscv64+100285.100.1.1 1762815565 installed
[riscv64] <13>May 8 06:17:33 rpmi: rpm-macros-cmake-4.0.0-alt1 sisyphus_riscv64+79196.100.1.1 1744049311 installed
[riscv64] Reading Package Lists...
[riscv64] Building Dependency Tree...
[riscv64] MI2a: marked for install (shallow): doxygen
[riscv64] MI2a: satisfying Depends: fontconfig (NULL)
[riscv64] MI2a: maybe install (a direct target): fontconfig 2.17.1-alt2:sisyphus_riscv64+93955.100.1.1 at 1756945910
[riscv64] MI2a: target SELECTED: fontconfig 2.17.1-alt2:sisyphus_riscv64+93955.100.1.1 at 1756945910
[riscv64] MI2a: requesting to install fontconfig (unspec'd ver; inspect with Debug::pkgMark-shallow)
[riscv64] MI2a: marked for install (shallow): fontconfig
[riscv64] MI2a: satisfying PreDepends: /usr/bin/xmlcatalog (NULL)
[riscv64] MI2a: maybe install (a providing target): xml-utils 1:2.14.6-alt3:sisyphus_riscv64+112566.100.1.1 at 1772465777
[riscv64] MI2a: target SELECTED: xml-utils 1:2.14.6-alt3:sisyphus_riscv64+112566.100.1.1 at 1772465777
[riscv64] MI2a: requesting to install xml-utils (unspec'd ver; inspect with Debug::pkgMark-shallow)
[riscv64] MI2a: marked for install (shallow): xml-utils
[riscv64] MI2a: satisfying Depends: xml-common (NULL)
[riscv64] MI2a: maybe install (a direct target): xml-common 0.6.3-alt15:sisyphus_riscv64+8304.100.1.1 at 1632333716
[riscv64] MI2a: target SELECTED: xml-common 0.6.3-alt15:sisyphus_riscv64+8304.100.1.1 at 1632333716
[riscv64] MI2a: requesting to install xml-common (unspec'd ver; inspect with Debug::pkgMark-shallow)
[riscv64] MI2a: marked for install (shallow): xml-common
[riscv64] MI2a: satisfying Depends: libxml2_16 = 1:2.14.6-alt3:sisyphus_riscv64+112566.100.1.1
[riscv64] MI2a: maybe install (a direct target): libxml2_16 1:2.14.6-alt3:sisyphus_riscv64+112566.100.1.1 at 1772465777
[riscv64] MI2a: target SELECTED: libxml2_16 1:2.14.6-alt3:sisyphus_riscv64+112566.100.1.1 at 1772465777
[riscv64] MI2a: requesting to install libxml2_16 (unspec'd ver; inspect with Debug::pkgMark-shallow)
[riscv64] MI2a: marked for install (shallow): libxml2_16
[riscv64] MI2a: satisfying Depends: libfontconfig1 = 2.17.1-alt2:sisyphus_riscv64+93955.100.1.1
[riscv64] MI2a: maybe install (a direct target): libfontconfig1 2.17.1-alt2:sisyphus_riscv64+93955.100.1.1 at 1756945910
[riscv64] MI2a: target SELECTED: libfontconfig1 2.17.1-alt2:sisyphus_riscv64+93955.100.1.1 at 1756945910
[riscv64] MI2a: requesting to install libfontconfig1 (unspec'd ver; inspect with Debug::pkgMark-shallow)
[riscv64] MI2a: marked for install (shallow): libfontconfig1
[riscv64] MI2a: satisfying Depends: libfreetype.so.6()(64bit) >= set:lgqTiyftOqKxwdqnIV5HufX080aBTqlvVAdZBtPOwgGxyybL8jpBd9E7U1S0
[riscv64] MI2a: maybe install (a providing target): libfreetype 2.14.3-alt1:sisyphus_riscv64+116242.100.1.1 at 1774475273
[riscv64] MI2a: target SELECTED: libfreetype 2.14.3-alt1:sisyphus_riscv64+116242.100.1.1 at 1774475273
[riscv64] MI2a: requesting to install libfreetype (unspec'd ver; inspect with Debug::pkgMark-shallow)
[riscv64] MI2a: marked for install (shallow): libfreetype
[riscv64] MI2a: satisfying PreDepends: libharfbuzz (NULL)
[riscv64] MI2a: maybe install (a direct target): libharfbuzz 14.2.0-alt1:sisyphus_riscv64+119763.100.1.1 at 1776728642
[riscv64] MI2a: target SELECTED: libharfbuzz 14.2.0-alt1:sisyphus_riscv64+119763.100.1.1 at 1776728642
[riscv64] MI2a: requesting to install libharfbuzz (unspec'd ver; inspect with Debug::pkgMark-shallow)
[riscv64] MI2a: marked for install (shallow): libharfbuzz
[riscv64] MI2a: satisfying Depends: libgraphite2.so.3()(64bit) >= set:kf32hGmUjq3tuKutzOJRzIQSHEyjposq2iEoszFE7SlOdnc
[riscv64] MI2a: maybe install (a providing target): libgraphite2 1.3.14-alt2.1:sisyphus_riscv64+8428.100.1.1 at 1633104905
[riscv64] MI2a: target SELECTED: libgraphite2 1.3.14-alt2.1:sisyphus_riscv64+8428.100.1.1 at 1633104905
[riscv64] MI2a: requesting to install libgraphite2 (unspec'd ver; inspect with Debug::pkgMark-shallow)
[riscv64] MI2a: marked for install (shallow): libgraphite2
[riscv64] MI2a: satisfying Depends: libpng16.so.16()(64bit) >= set:lgHMZqVDRD0kR9l2ubqh0oFit3O0McB8TsZ6P9oIhrwRuQVCndqQbRwmJHctM3crxzLX2brsQfr0
[riscv64] MI2a: maybe install (a providing target): libpng16 1.6.56-alt2:sisyphus_riscv64+116624.100.1.1 at 1774644819
[riscv64] MI2a: target SELECTED: libpng16 1.6.56-alt2:sisyphus_riscv64+116624.100.1.1 at 1774644819
[riscv64] MI2a: requesting to install libpng16 (unspec'd ver; inspect with Debug::pkgMark-shallow)
[riscv64] MI2a: marked for install (shallow): libpng16
[riscv64] MI2a: satisfying Depends: libbrotlidec.so.1()(64bit) >= set:hgSP7
[riscv64] MI2a: maybe install (a providing target): libbrotlidec 1.2.0-alt1:sisyphus_riscv64+98962.100.1.1 at 1761678642
[riscv64] MI2a: target SELECTED: libbrotlidec 1.2.0-alt1:sisyphus_riscv64+98962.100.1.1 at 1761678642
[riscv64] MI2a: requesting to install libbrotlidec (unspec'd ver; inspect with Debug::pkgMark-shallow)
[riscv64] MI2a: marked for install (shallow): libbrotlidec
[riscv64] MI2a: satisfying Depends: libbrotlicommon = 1.2.0-alt1:sisyphus_riscv64+98962.100.1.1
[riscv64] MI2a: maybe install (a direct target): libbrotlicommon 1.2.0-alt1:sisyphus_riscv64+98962.100.1.1 at 1761678642
[riscv64] MI2a: target SELECTED: libbrotlicommon 1.2.0-alt1:sisyphus_riscv64+98962.100.1.1 at 1761678642
[riscv64] MI2a: requesting to install libbrotlicommon (unspec'd ver; inspect with Debug::pkgMark-shallow)
[riscv64] MI2a: marked for install (shallow): libbrotlicommon
[riscv64] MI2a: satisfying Depends: fonts-ttf-dejavu (NULL)
[riscv64] MI2a: maybe install (a direct target): fonts-ttf-dejavu 2.37-alt2:sisyphus_riscv64+9016.100.1.1 at 1633885219
[riscv64] MI2a: target SELECTED: fonts-ttf-dejavu 2.37-alt2:sisyphus_riscv64+9016.100.1.1 at 1633885219
[riscv64] MI2a: requesting to install fonts-ttf-dejavu (unspec'd ver; inspect with Debug::pkgMark-shallow)
[riscv64] MI2a: marked for install (shallow): fonts-ttf-dejavu
[riscv64] MI2a: marked for install (shallow): gcc-c++
[riscv64] MI2a: satisfying Depends: gcc14-c++ (NULL)
[riscv64] MI2a: maybe install (a direct target): gcc14-c++ 14.3.1-alt0.port.2:sisyphus_riscv64+98534.200.1.1 at 1761243914
[riscv64] MI2a: target SELECTED: gcc14-c++ 14.3.1-alt0.port.2:sisyphus_riscv64+98534.200.1.1 at 1761243914
[riscv64] MI2a: requesting to install gcc14-c++ (unspec'd ver; inspect with Debug::pkgMark-shallow)
[riscv64] MI2a: marked for install (shallow): gcc14-c++
[riscv64] MI2a: satisfying Depends: libstdc++14-devel = 14.3.1-alt0.port.2:sisyphus_riscv64+98534.200.1.1
[riscv64] MI2a: maybe install (a direct target): libstdc++14-devel 14.3.1-alt0.port.2:sisyphus_riscv64+98534.200.1.1 at 1761243914
[riscv64] MI2a: target SELECTED: libstdc++14-devel 14.3.1-alt0.port.2:sisyphus_riscv64+98534.200.1.1 at 1761243914
[riscv64] MI2a: requesting to install libstdc++14-devel (unspec'd ver; inspect with Debug::pkgMark-shallow)
[riscv64] MI2a: marked for install (shallow): libstdc++14-devel
[riscv64] MI2a: satisfying PreDepends: gcc-c++-common >= 1.4.7
[riscv64] MI2a: maybe install (a direct target): gcc-c++-common 1.4.28-alt1:sisyphus_riscv64+49202.100.1.1 at 1716505224
[riscv64] MI2a: target SELECTED: gcc-c++-common 1.4.28-alt1:sisyphus_riscv64+49202.100.1.1 at 1716505224
[riscv64] MI2a: requesting to install gcc-c++-common (unspec'd ver; inspect with Debug::pkgMark-shallow)
[riscv64] MI2a: marked for install (shallow): gcc-c++-common
[riscv64] MI2a: marked for install (shallow): libmysqlclient21-devel
[riscv64] MI2a: satisfying Depends: libmysqlclient21 = 8.0.44-alt1:sisyphus_riscv64+101698.100.1.1
[riscv64] MI2a: maybe install (a direct target): libmysqlclient21 8.0.44-alt1:sisyphus_riscv64+101698.100.1.1 at 1764078611
[riscv64] MI2a: target SELECTED: libmysqlclient21 8.0.44-alt1:sisyphus_riscv64+101698.100.1.1 at 1764078611
[riscv64] MI2a: requesting to install libmysqlclient21 (unspec'd ver; inspect with Debug::pkgMark-shallow)
[riscv64] MI2a: marked for install (shallow): libmysqlclient21
[riscv64] MI2a: marked for install (shallow): libcfitsio-devel
[riscv64] MI2a: satisfying Depends: libcfitsio10 = 4.6.2-alt2:sisyphus_riscv64+90931.100.1.1
[riscv64] MI2a: maybe install (a direct target): libcfitsio10 4.6.2-alt2:sisyphus_riscv64+90931.100.1.1 at 1753891098
[riscv64] MI2a: target SELECTED: libcfitsio10 4.6.2-alt2:sisyphus_riscv64+90931.100.1.1 at 1753891098
[riscv64] MI2a: requesting to install libcfitsio10 (unspec'd ver; inspect with Debug::pkgMark-shallow)
[riscv64] MI2a: marked for install (shallow): libcfitsio10
[riscv64] MI2a: marked for install (shallow): libcurl-devel
[riscv64] MI2a: satisfying Depends: bc (NULL)
[riscv64] MI2a: maybe install (a direct target): bc 1:1.07.1-alt1:sisyphus_riscv64+49305.100.1.1 at 1716572003
[riscv64] MI2a: target SELECTED: bc 1:1.07.1-alt1:sisyphus_riscv64+49305.100.1.1 at 1716572003
[riscv64] MI2a: requesting to install bc (unspec'd ver; inspect with Debug::pkgMark-shallow)
[riscv64] MI2a: marked for install (shallow): bc
[riscv64] MI2a: satisfying Depends: libcurl = 8.19.0-alt1:sisyphus_riscv64+114193.100.1.1
[riscv64] MI2a: maybe install (a direct target): libcurl 8.19.0-alt1:sisyphus_riscv64+114193.100.1.1 at 1773233071
[riscv64] MI2a: target SELECTED: libcurl 8.19.0-alt1:sisyphus_riscv64+114193.100.1.1 at 1773233071
[riscv64] MI2a: requesting to install libcurl (unspec'd ver; inspect with Debug::pkgMark-shallow)
[riscv64] MI2a: marked for install (shallow): libcurl
[riscv64] MI2a: satisfying Depends: libgnutls.so.30()(64bit) >= set:ohWzKsl3gEhunQQpmsYd9i7QCtiGyfZ1Iaw1tOFZbdeEKESximCRPnIehs3AEMQXZ0e8KN9yV59f8Zeu5QHTtKkulI9mjuLg9NIizyZhpZCsx8sGEZDBhhgZvpnajdZvocWora9BdPXEcA4Z2ghEYo7SHlnQVUueZmZ3mRKhNiuOM9tTyPiwFvw4TZenCjcambbGWLShwembtEyVtUcNpLjugdka8b4
[riscv64] MI2a: maybe install (a providing target): libgnutls30 3.8.12-alt1:sisyphus_riscv64+110321.100.1.1 at 1770858507
[riscv64] MI2a: target SELECTED: libgnutls30 3.8.12-alt1:sisyphus_riscv64+110321.100.1.1 at 1770858507
[riscv64] MI2a: requesting to install libgnutls30 (unspec'd ver; inspect with Debug::pkgMark-shallow)
[riscv64] MI2a: marked for install (shallow): libgnutls30
[riscv64] MI2a: satisfying Depends: libhogweed.so.6()(64bit) >= set:mfnnj2ZgBdeg17M87tPneezLu1hRaAv7Mvee2P332bHTaZjeCozdeChKl8zpQyflmS6Vy6tRmgHXyW1dkybK4gSLUc4ZqST6Otwai2tAwz0231mJ0KXX1SRmE5Wv1xA3elkz1fS4ARIDtHglVAVYGsrdTpOlAk7oFZ51ji2BIsI0W6X7ePZg
[riscv64] MI2a: maybe install (a providing target): libhogweed6 3.10.1-alt1:sisyphus_riscv64+71375.100.1.1 at 1738106891
[riscv64] MI2a: target SELECTED: libhogweed6 3.10.1-alt1:sisyphus_riscv64+71375.100.1.1 at 1738106891
[riscv64] MI2a: requesting to install libhogweed6 (unspec'd ver; inspect with Debug::pkgMark-shallow)
[riscv64] MI2a: marked for install (shallow): libhogweed6
[riscv64] MI2a: satisfying Depends: libnettle8 = 3.10.1-alt1:sisyphus_riscv64+71375.100.1.1
[riscv64] MI2a: maybe install (a direct target): libnettle8 3.10.1-alt1:sisyphus_riscv64+71375.100.1.1 at 1738106891
[riscv64] MI2a: target SELECTED: libnettle8 3.10.1-alt1:sisyphus_riscv64+71375.100.1.1 at 1738106891
[riscv64] MI2a: requesting to install libnettle8 (unspec'd ver; inspect with Debug::pkgMark-shallow)
[riscv64] MI2a: marked for install (shallow): libnettle8
[riscv64] MI2a: satisfying Depends: libidn2.so.0()(64bit) >= set:ifaFMURofX11
[riscv64] MI2a: maybe install (a providing target): libidn2 2.3.8-alt1:sisyphus_riscv64+93492.100.1.1 at 1756433243
[riscv64] MI2a: target SELECTED: libidn2 2.3.8-alt1:sisyphus_riscv64+93492.100.1.1 at 1756433243
[riscv64] MI2a: requesting to install libidn2 (unspec'd ver; inspect with Debug::pkgMark-shallow)
[riscv64] MI2a: marked for install (shallow): libidn2
[riscv64] MI2a: satisfying Depends: libgssapi_krb5.so.2()(64bit) >= set:lherpSlTisKmUUCXy5icVuAslwGLwcm0
[riscv64] MI2a: maybe install (a providing target): libkrb5 1.22.2-alt1:sisyphus_riscv64+109182.100.1.1 at 1770257536
[riscv64] MI2a: target SELECTED: libkrb5 1.22.2-alt1:sisyphus_riscv64+109182.100.1.1 at 1770257536
[riscv64] MI2a: requesting to install libkrb5 (unspec'd ver; inspect with Debug::pkgMark-shallow)
[riscv64] MI2a: marked for install (shallow): libkrb5
[riscv64] MI2a: satisfying Depends: libcom_err.so.2()(64bit) >= set:ifPl8xIvqGQAmqI1
[riscv64] MI2a: maybe install (a providing target): libcom_err 1.47.1.0.10.ad56-alt2:sisyphus_riscv64+65703.100.1.1 at 1732769486
[riscv64] MI2a: target SELECTED: libcom_err 1.47.1.0.10.ad56-alt2:sisyphus_riscv64+65703.100.1.1 at 1732769486
[riscv64] MI2a: requesting to install libcom_err (unspec'd ver; inspect with Debug::pkgMark-shallow)
[riscv64] MI2a: marked for install (shallow): libcom_err
[riscv64] MI2a: satisfying Depends: libkeyutils.so.1()(64bit) >= set:jfWn12U6KThBXgruPLZ68yYZt2
[riscv64] MI2a: maybe install (a providing target): libkeyutils 1.6.3-alt1:sisyphus_riscv64+49335.100.1.1 at 1716592270
[riscv64] MI2a: target SELECTED: libkeyutils 1.6.3-alt1:sisyphus_riscv64+49335.100.1.1 at 1716592270
[riscv64] MI2a: requesting to install libkeyutils (unspec'd ver; inspect with Debug::pkgMark-shallow)
[riscv64] MI2a: marked for install (shallow): libkeyutils
[riscv64] MI2a: satisfying Depends: liblmdb.so.0()(64bit) >= set:kfalKd4xYAkaAG2MqeH0wB2F4kTaBEo1iv0KFpxVmqzFIV6HJ0
[riscv64] MI2a: maybe install (a providing target): liblmdb 0.9.35-alt1:sisyphus_riscv64+111449.100.1.1 at 1771669538
[riscv64] MI2a: target SELECTED: liblmdb 0.9.35-alt1:sisyphus_riscv64+111449.100.1.1 at 1771669538
[riscv64] MI2a: requesting to install liblmdb (unspec'd ver; inspect with Debug::pkgMark-shallow)
[riscv64] MI2a: marked for install (shallow): liblmdb
[riscv64] MI2a: satisfying Depends: libverto.so.1()(64bit) >= set:jfI5MRvI6tmNn0zwQdb68Gk0
[riscv64] MI2a: maybe install (a providing target): libverto 0.3.2-alt1_1:sisyphus_riscv64+33133.1200.2.1 at 1684932150
[riscv64] MI2a: target SELECTED: libverto 0.3.2-alt1_1:sisyphus_riscv64+33133.1200.2.1 at 1684932150
[riscv64] MI2a: requesting to install libverto (unspec'd ver; inspect with Debug::pkgMark-shallow)
[riscv64] MI2a: marked for install (shallow): libverto
[riscv64] MI2a: satisfying Depends: liblber.so.2()(64bit) >= set:liRJP9c9FzZ8q5FRsZ21
[riscv64] MI2a: maybe install (a providing target): libldap2 2.6.13-alt1:sisyphus_riscv64+115149.100.1.1 at 1773831165
[riscv64] MI2a: target SELECTED: libldap2 2.6.13-alt1:sisyphus_riscv64+115149.100.1.1 at 1773831165
[riscv64] MI2a: requesting to install libldap2 (unspec'd ver; inspect with Debug::pkgMark-shallow)
[riscv64] MI2a: marked for install (shallow): libldap2
[riscv64] MI2a: satisfying Depends: libsasl2.so.3()(64bit) >= set:lhKAh7QjCM36Vnr6MdFxFf8LIcZsS1kl0wH7Iyp
[riscv64] MI2a: maybe install (a providing target): libsasl2-3 2.1.28-alt3:sisyphus_riscv64+97037.1100.1.1 at 1761044620
[riscv64] MI2a: target SELECTED: libsasl2-3 2.1.28-alt3:sisyphus_riscv64+97037.1100.1.1 at 1761044620
[riscv64] MI2a: requesting to install libsasl2-3 (unspec'd ver; inspect with Debug::pkgMark-shallow)
[riscv64] MI2a: marked for install (shallow): libsasl2-3
[riscv64] MI2a: satisfying Depends: openldap-common = 2.6.13-alt1:sisyphus_riscv64+115149.100.1.1
[riscv64] MI2a: maybe install (a direct target): openldap-common 2.6.13-alt1:sisyphus_riscv64+115149.100.1.1 at 1773831165
[riscv64] MI2a: target SELECTED: openldap-common 2.6.13-alt1:sisyphus_riscv64+115149.100.1.1 at 1773831165
[riscv64] MI2a: requesting to install openldap-common (unspec'd ver; inspect with Debug::pkgMark-shallow)
[riscv64] MI2a: marked for install (shallow): openldap-common
[riscv64] MI2a: satisfying Depends: libnghttp2.so.14()(64bit) >= set:lfKRgJ8UKsv8mdZbLF8OxWTLVASoUAdxTu6rssIpilYsUcqHL2CMZk6qphw90tGPaquCWnihEqT3x957koIkZCHIxV7ahJ9tEyXiPz1HGgyJf9XN1
[riscv64] MI2a: maybe install (a providing target): libnghttp2 1.69.0-alt1:sisyphus_riscv64+119674.100.1.1 at 1776693019
[riscv64] MI2a: target SELECTED: libnghttp2 1.69.0-alt1:sisyphus_riscv64+119674.100.1.1 at 1776693019
[riscv64] MI2a: requesting to install libnghttp2 (unspec'd ver; inspect with Debug::pkgMark-shallow)
[riscv64] MI2a: marked for install (shallow): libnghttp2
[riscv64] MI2a: satisfying Depends: libnghttp3.so.9()(64bit) >= set:kfOHsymuRovZfZIawj4ST8bIZ8gAm9fzcRFVxt87YccZeAlZwFcI1
[riscv64] MI2a: maybe install (a providing target): libnghttp3.9 1.15.0-alt1:sisyphus_riscv64+109528.100.1.1 at 1770403504
[riscv64] MI2a: target SELECTED: libnghttp3.9 1.15.0-alt1:sisyphus_riscv64+109528.100.1.1 at 1770403504
[riscv64] MI2a: requesting to install libnghttp3.9 (unspec'd ver; inspect with Debug::pkgMark-shallow)
[riscv64] MI2a: marked for install (shallow): libnghttp3.9
[riscv64] MI2a: satisfying Depends: libngtcp2.so.16()(64bit) >= set:keggzSiMInQoBgrlYWxUop2IDL4Ex9NmxfNlE3UoZ6bvfiZqFvOST53COjeztU9wCUsjA8uuZ8sodbhSgNzKYVngELjUy4
[riscv64] MI2a: maybe install (a providing target): libngtcp2.16 1.22.1-alt1:sisyphus_riscv64+119497.100.1.1 at 1776530589
[riscv64] MI2a: target SELECTED: libngtcp2.16 1.22.1-alt1:sisyphus_riscv64+119497.100.1.1 at 1776530589
[riscv64] MI2a: requesting to install libngtcp2.16 (unspec'd ver; inspect with Debug::pkgMark-shallow)
[riscv64] MI2a: marked for install (shallow): libngtcp2.16
[riscv64] MI2a: satisfying Depends: libngtcp2_crypto_gnutls8 = 1.22.1-alt1:sisyphus_riscv64+119497.100.1.1
[riscv64] MI2a: maybe install (a direct target): libngtcp2_crypto_gnutls8 1.22.1-alt1:sisyphus_riscv64+119497.100.1.1 at 1776530589
[riscv64] MI2a: target SELECTED: libngtcp2_crypto_gnutls8 1.22.1-alt1:sisyphus_riscv64+119497.100.1.1 at 1776530589
[riscv64] MI2a: requesting to install libngtcp2_crypto_gnutls8 (unspec'd ver; inspect with Debug::pkgMark-shallow)
[riscv64] MI2a: marked for install (shallow): libngtcp2_crypto_gnutls8
[riscv64] MI2a: satisfying Depends: libpsl.so.5()(64bit) >= set:ifo8sG4NYozTZj0
[riscv64] MI2a: maybe install (a providing target): libpsl 0.21.5-alt2:sisyphus_riscv64+113057.100.1.1 at 1772681237
[riscv64] MI2a: target SELECTED: libpsl 0.21.5-alt2:sisyphus_riscv64+113057.100.1.1 at 1772681237
[riscv64] MI2a: requesting to install libpsl (unspec'd ver; inspect with Debug::pkgMark-shallow)
[riscv64] MI2a: marked for install (shallow): libpsl
[riscv64] MI2a: satisfying Depends: publicsuffix-list-dafsa (NULL)
[riscv64] MI2a: maybe install (a direct target): publicsuffix-list-dafsa 20260302-alt1:sisyphus_riscv64+113004.100.1.1 at 1772666916
[riscv64] MI2a: target SELECTED: publicsuffix-list-dafsa 20260302-alt1:sisyphus_riscv64+113004.100.1.1 at 1772666916
[riscv64] MI2a: requesting to install publicsuffix-list-dafsa (unspec'd ver; inspect with Debug::pkgMark-shallow)
[riscv64] MI2a: marked for install (shallow): publicsuffix-list-dafsa
[riscv64] MI2a: satisfying Depends: libssh2.so.1()(64bit) >= set:lfFi2ZJdCZnNQqC7FxZHyYYVCMxI4j17rwEg278PVigoIDqIcaZ7xJLD99atVtQH9iZsC5Ell61tgIGFLCeeSh67CMC5lPNAQgzzPc5RvPDTKNRR6pS6HYOOQEA2K29rU2BrZhHHo1LquRo5Z2v1
[riscv64] MI2a: maybe install (a providing target): libssh2 1.11.1-alt1:sisyphus_riscv64+105876.100.1.1 at 1767360901
[riscv64] MI2a: target SELECTED: libssh2 1.11.1-alt1:sisyphus_riscv64+105876.100.1.1 at 1767360901
[riscv64] MI2a: requesting to install libssh2 (unspec'd ver; inspect with Debug::pkgMark-shallow)
[riscv64] MI2a: marked for install (shallow): libssh2
[riscv64] MI2a: marked for install (shallow): libgeos-devel
[riscv64] MI2a: satisfying Depends: libgeos = 3.14.1-alt1:sisyphus_riscv64+98943.100.1.1
[riscv64] MI2a: maybe install (a direct target): libgeos 3.14.1-alt1:sisyphus_riscv64+98943.100.1.1 at 1761677580
[riscv64] MI2a: target SELECTED: libgeos 3.14.1-alt1:sisyphus_riscv64+98943.100.1.1 at 1761677580
[riscv64] MI2a: requesting to install libgeos (unspec'd ver; inspect with Debug::pkgMark-shallow)
[riscv64] MI2a: marked for install (shallow): libgeos
[riscv64] MI2a: marked for install (shallow): libgif-devel
[riscv64] MI2a: satisfying Depends: libgif = 4.1.6-alt4:sisyphus_riscv64+82086.100.1.1
[riscv64] MI2a: maybe install (a direct target): libgif 4.1.6-alt4:sisyphus_riscv64+82086.100.1.1 at 1746483145
[riscv64] MI2a: target SELECTED: libgif 4.1.6-alt4:sisyphus_riscv64+82086.100.1.1 at 1746483145
[riscv64] MI2a: requesting to install libgif (unspec'd ver; inspect with Debug::pkgMark-shallow)
[riscv64] MI2a: marked for install (shallow): libgif
[riscv64] MI2a: marked for install (shallow): libhdf5-devel
[riscv64] MI2a: satisfying Depends: libstdc++-devel (NULL)
[riscv64] MI2a: maybe install (a direct target): libstdc++-devel 14-alt1:sisyphus_riscv64+56300.300.2.1 at 1732276643
[riscv64] MI2a: target SELECTED: libstdc++-devel 14-alt1:sisyphus_riscv64+56300.300.2.1 at 1732276643
[riscv64] MI2a: requesting to install libstdc++-devel (unspec'd ver; inspect with Debug::pkgMark-shallow)
[riscv64] MI2a: marked for install (shallow): libstdc++-devel
[riscv64] MI2a: satisfying Depends: zlib-devel (NULL)
[riscv64] MI2a: maybe install (a direct target): zlib-devel 1.3.1-alt1:sisyphus_riscv64+45939.100.1.1 at 1710445788
[riscv64] MI2a: target SELECTED: zlib-devel 1.3.1-alt1:sisyphus_riscv64+45939.100.1.1 at 1710445788
[riscv64] MI2a: requesting to install zlib-devel (unspec'd ver; inspect with Debug::pkgMark-shallow)
[riscv64] MI2a: marked for install (shallow): zlib-devel
[riscv64] MI2a: satisfying Depends: libhdf5-hl-310 = 1.14.6-alt1:sisyphus_riscv64+74339.100.1.1
[riscv64] MI2a: maybe install (a direct target): libhdf5-hl-310 1.14.6-alt1:sisyphus_riscv64+74339.100.1.1 at 1740518877
[riscv64] MI2a: target SELECTED: libhdf5-hl-310 1.14.6-alt1:sisyphus_riscv64+74339.100.1.1 at 1740518877
[riscv64] MI2a: requesting to install libhdf5-hl-310 (unspec'd ver; inspect with Debug::pkgMark-shallow)
[riscv64] MI2a: marked for install (shallow): libhdf5-hl-310
[riscv64] MI2a: satisfying Depends: libhdf5-310 = 1.14.6-alt1:sisyphus_riscv64+74339.100.1.1
[riscv64] MI2a: maybe install (a direct target): libhdf5-310 1.14.6-alt1:sisyphus_riscv64+74339.100.1.1 at 1740518877
[riscv64] MI2a: target SELECTED: libhdf5-310 1.14.6-alt1:sisyphus_riscv64+74339.100.1.1 at 1740518877
[riscv64] MI2a: requesting to install libhdf5-310 (unspec'd ver; inspect with Debug::pkgMark-shallow)
[riscv64] MI2a: marked for install (shallow): libhdf5-310
[riscv64] MI2a: marked for install (shallow): libjpeg-devel
[riscv64] MI2a: satisfying Depends: libturbojpeg = 2:3.1.4.1-alt1:sisyphus_riscv64+117065.100.1.1
[riscv64] MI2a: maybe install (a direct target): libturbojpeg 2:3.1.4.1-alt1:sisyphus_riscv64+117065.100.1.1 at 1774912965
[riscv64] MI2a: target SELECTED: libturbojpeg 2:3.1.4.1-alt1:sisyphus_riscv64+117065.100.1.1 at 1774912965
[riscv64] MI2a: requesting to install libturbojpeg (unspec'd ver; inspect with Debug::pkgMark-shallow)
[riscv64] MI2a: marked for install (shallow): libturbojpeg
[riscv64] MI2a: satisfying Depends: libjpeg = 2:3.1.4.1-alt1:sisyphus_riscv64+117065.100.1.1
[riscv64] MI2a: maybe install (a direct target): libjpeg 2:3.1.4.1-alt1:sisyphus_riscv64+117065.100.1.1 at 1774912965
[riscv64] MI2a: target SELECTED: libjpeg 2:3.1.4.1-alt1:sisyphus_riscv64+117065.100.1.1 at 1774912965
[riscv64] MI2a: requesting to install libjpeg (unspec'd ver; inspect with Debug::pkgMark-shallow)
[riscv64] MI2a: marked for install (shallow): libjpeg
[riscv64] MI2a: marked for install (shallow): libunixODBC-devel
[riscv64] MI2a: satisfying Depends: libunixODBC-devel-compat = 2.3.14-alt1:sisyphus_riscv64+113450.100.1.1
[riscv64] MI2a: maybe install (a direct target): libunixODBC-devel-compat 2.3.14-alt1:sisyphus_riscv64+113450.100.1.1 at 1773003977
[riscv64] MI2a: target SELECTED: libunixODBC-devel-compat 2.3.14-alt1:sisyphus_riscv64+113450.100.1.1 at 1773003977
[riscv64] MI2a: requesting to install libunixODBC-devel-compat (unspec'd ver; inspect with Debug::pkgMark-shallow)
[riscv64] MI2a: marked for install (shallow): libunixODBC-devel-compat
[riscv64] MI2a: satisfying Depends: libunixODBC2 = 2.3.14-alt1:sisyphus_riscv64+113450.100.1.1
[riscv64] MI2a: maybe install (a direct target): libunixODBC2 2.3.14-alt1:sisyphus_riscv64+113450.100.1.1 at 1773003977
[riscv64] MI2a: target SELECTED: libunixODBC2 2.3.14-alt1:sisyphus_riscv64+113450.100.1.1 at 1773003977
[riscv64] MI2a: requesting to install libunixODBC2 (unspec'd ver; inspect with Debug::pkgMark-shallow)
[riscv64] MI2a: marked for install (shallow): libunixODBC2
[riscv64] MI2a: satisfying Depends: libltdl.so.7()(64bit) >= set:kheqU6z7F08heHK0
[riscv64] MI2a: maybe install (a providing target): libltdl7 2.4.7-alt5:sisyphus_riscv64+83173.300.1.1 at 1747744349
[riscv64] MI2a: target SELECTED: libltdl7 2.4.7-alt5:sisyphus_riscv64+83173.300.1.1 at 1747744349
[riscv64] MI2a: requesting to install libltdl7 (unspec'd ver; inspect with Debug::pkgMark-shallow)
[riscv64] MI2a: marked for install (shallow): libltdl7
[riscv64] MI2a: marked for install (shallow): postgresql-devel
[riscv64] MI2a: satisfying Depends: postgresql18-devel = 18.3-alt2:sisyphus_riscv64+115682.100.1.1
[riscv64] MI2a: maybe install (a direct target): postgresql18-devel 18.3-alt2:sisyphus_riscv64+115682.100.1.1 at 1774051756
[riscv64] MI2a: target SELECTED: postgresql18-devel 18.3-alt2:sisyphus_riscv64+115682.100.1.1 at 1774051756
[riscv64] MI2a: requesting to install postgresql18-devel (unspec'd ver; inspect with Debug::pkgMark-shallow)
[riscv64] MI2a: marked for install (shallow): postgresql18-devel
[riscv64] MI2a: satisfying Depends: postgresql18-server-devel = 18.3-alt2:sisyphus_riscv64+115682.100.1.1
[riscv64] MI2a: maybe install (a direct target): postgresql18-server-devel 18.3-alt2:sisyphus_riscv64+115682.100.1.1 at 1774051756
[riscv64] MI2a: target SELECTED: postgresql18-server-devel 18.3-alt2:sisyphus_riscv64+115682.100.1.1 at 1774051756
[riscv64] MI2a: requesting to install postgresql18-server-devel (unspec'd ver; inspect with Debug::pkgMark-shallow)
[riscv64] MI2a: marked for install (shallow): postgresql18-server-devel
[riscv64] MI2a: satisfying Depends: llvm20.1-devel (NULL)
[riscv64] MI2a: maybe install (a direct target): llvm20.1-devel 20.1.8-alt0.4:sisyphus_riscv64+98769.100.1.1 at 1761640977
[riscv64] MI2a: target SELECTED: llvm20.1-devel 20.1.8-alt0.4:sisyphus_riscv64+98769.100.1.1 at 1761640977
[riscv64] MI2a: requesting to install llvm20.1-devel (unspec'd ver; inspect with Debug::pkgMark-shallow)
[riscv64] MI2a: marked for install (shallow): llvm20.1-devel
[riscv64] MI2a: satisfying Depends: llvm-devel >= 19.1
[riscv64] MI2a: maybe install (a direct target): llvm-devel 21.1.0-alt0.port:sisyphus_riscv64+116396.100.1.1 at 1774506530
[riscv64] MI2a: target SELECTED: llvm-devel 21.1.0-alt0.port:sisyphus_riscv64+116396.100.1.1 at 1774506530
[riscv64] MI2a: requesting to install llvm-devel (unspec'd ver; inspect with Debug::pkgMark-shallow)
[riscv64] MI2a: marked for install (shallow): llvm-devel
[riscv64] MI2a: satisfying Depends: llvm21.1-devel (NULL)
[riscv64] MI2a: maybe install (a direct target): llvm21.1-devel 21.1.8-alt0.2:sisyphus_riscv64+105756.100.1.1 at 1767141832
[riscv64] MI2a: target SELECTED: llvm21.1-devel 21.1.8-alt0.2:sisyphus_riscv64+105756.100.1.1 at 1767141832
[riscv64] MI2a: requesting to install llvm21.1-devel (unspec'd ver; inspect with Debug::pkgMark-shallow)
[riscv64] MI2a: marked for install (shallow): llvm21.1-devel
[riscv64] MI2a: satisfying Depends: llvm21.1 = 21.1.8-alt0.2:sisyphus_riscv64+105756.100.1.1
[riscv64] MI2a: maybe install (a direct target): llvm21.1 21.1.8-alt0.2:sisyphus_riscv64+105756.100.1.1 at 1767141832
[riscv64] MI2a: target SELECTED: llvm21.1 21.1.8-alt0.2:sisyphus_riscv64+105756.100.1.1 at 1767141832
[riscv64] MI2a: requesting to install llvm21.1 (unspec'd ver; inspect with Debug::pkgMark-shallow)
[riscv64] MI2a: marked for install (shallow): llvm21.1
[riscv64] MI2a: satisfying Depends: llvm >= 20.1
[riscv64] MI2a: maybe install (a direct target): llvm 21.1.0-alt0.port:sisyphus_riscv64+116396.100.1.1 at 1774506530
[riscv64] MI2a: target SELECTED: llvm 21.1.0-alt0.port:sisyphus_riscv64+116396.100.1.1 at 1774506530
[riscv64] MI2a: requesting to install llvm (unspec'd ver; inspect with Debug::pkgMark-shallow)
[riscv64] MI2a: marked for install (shallow): llvm
[riscv64] MI2a: satisfying PreDepends: llvm-common = 21.1.0-alt0.port:sisyphus_riscv64+116396.100.1.1
[riscv64] MI2a: maybe install (a direct target): llvm-common 21.1.0-alt0.port:sisyphus_riscv64+116396.100.1.1 at 1774506530
[riscv64] MI2a: target SELECTED: llvm-common 21.1.0-alt0.port:sisyphus_riscv64+116396.100.1.1 at 1774506530
[riscv64] MI2a: requesting to install llvm-common (unspec'd ver; inspect with Debug::pkgMark-shallow)
[riscv64] MI2a: marked for install (shallow): llvm-common
[riscv64] MI2a: satisfying Depends: libclang-cpp21 = 21.1.8-alt0.2:sisyphus_riscv64+105756.100.1.1
[riscv64] MI2a: maybe install (a direct target): libclang-cpp21 21.1.8-alt0.2:sisyphus_riscv64+105756.100.1.1 at 1767141832
[riscv64] MI2a: target SELECTED: libclang-cpp21 21.1.8-alt0.2:sisyphus_riscv64+105756.100.1.1 at 1767141832
[riscv64] MI2a: requesting to install libclang-cpp21 (unspec'd ver; inspect with Debug::pkgMark-shallow)
[riscv64] MI2a: marked for install (shallow): libclang-cpp21
[riscv64] MI2a: satisfying Depends: llvm21.1-libs = 21.1.8-alt0.2:sisyphus_riscv64+105756.100.1.1
[riscv64] MI2a: maybe install (a direct target): llvm21.1-libs 21.1.8-alt0.2:sisyphus_riscv64+105756.100.1.1 at 1767141832
[riscv64] MI2a: target SELECTED: llvm21.1-libs 21.1.8-alt0.2:sisyphus_riscv64+105756.100.1.1 at 1767141832
[riscv64] MI2a: requesting to install llvm21.1-libs (unspec'd ver; inspect with Debug::pkgMark-shallow)
[riscv64] MI2a: marked for install (shallow): llvm21.1-libs
[riscv64] MI2a: satisfying Depends: llvm21.1-gold = 21.1.8-alt0.2:sisyphus_riscv64+105756.100.1.1
[riscv64] MI2a: maybe install (a direct target): llvm21.1-gold 21.1.8-alt0.2:sisyphus_riscv64+105756.100.1.1 at 1767141832
[riscv64] MI2a: target SELECTED: llvm21.1-gold 21.1.8-alt0.2:sisyphus_riscv64+105756.100.1.1 at 1767141832
[riscv64] MI2a: requesting to install llvm21.1-gold (unspec'd ver; inspect with Debug::pkgMark-shallow)
[riscv64] MI2a: marked for install (shallow): llvm21.1-gold
[riscv64] MI2a: satisfying Depends: llvm21.1-polly = 21.1.8-alt0.2:sisyphus_riscv64+105756.100.1.1
[riscv64] MI2a: maybe install (a direct target): llvm21.1-polly 21.1.8-alt0.2:sisyphus_riscv64+105756.100.1.1 at 1767141832
[riscv64] MI2a: target SELECTED: llvm21.1-polly 21.1.8-alt0.2:sisyphus_riscv64+105756.100.1.1 at 1767141832
[riscv64] MI2a: requesting to install llvm21.1-polly (unspec'd ver; inspect with Debug::pkgMark-shallow)
[riscv64] MI2a: marked for install (shallow): llvm21.1-polly
[riscv64] MI2a: satisfying Depends: llvm21.1-filesystem = 21.1.8-alt0.2:sisyphus_riscv64+105756.100.1.1
[riscv64] MI2a: maybe install (a direct target): llvm21.1-filesystem 21.1.8-alt0.2:sisyphus_riscv64+105756.100.1.1 at 1767141832
[riscv64] MI2a: target SELECTED: llvm21.1-filesystem 21.1.8-alt0.2:sisyphus_riscv64+105756.100.1.1 at 1767141832
[riscv64] MI2a: requesting to install llvm21.1-filesystem (unspec'd ver; inspect with Debug::pkgMark-shallow)
[riscv64] MI2a: marked for install (shallow): llvm21.1-filesystem
[riscv64] MI2a: satisfying Depends: mlir21.1-tools (NULL)
[riscv64] MI2a: maybe install (a direct target): mlir21.1-tools 21.1.8-alt0.2:sisyphus_riscv64+105756.100.1.1 at 1767141832
[riscv64] MI2a: target SELECTED: mlir21.1-tools 21.1.8-alt0.2:sisyphus_riscv64+105756.100.1.1 at 1767141832
[riscv64] MI2a: requesting to install mlir21.1-tools (unspec'd ver; inspect with Debug::pkgMark-shallow)
[riscv64] MI2a: marked for install (shallow): mlir21.1-tools
[riscv64] MI2a: satisfying Depends: libmlir21.1 = 21.1.8-alt0.2:sisyphus_riscv64+105756.100.1.1
[riscv64] MI2a: maybe install (a direct target): libmlir21.1 21.1.8-alt0.2:sisyphus_riscv64+105756.100.1.1 at 1767141832
[riscv64] MI2a: target SELECTED: libmlir21.1 21.1.8-alt0.2:sisyphus_riscv64+105756.100.1.1 at 1767141832
[riscv64] MI2a: requesting to install libmlir21.1 (unspec'd ver; inspect with Debug::pkgMark-shallow)
[riscv64] MI2a: marked for install (shallow): libmlir21.1
[riscv64] MI2a: satisfying Depends: llvm20.1 = 20.1.8-alt0.4:sisyphus_riscv64+98769.100.1.1
[riscv64] MI2a: maybe install (a direct target): llvm20.1 20.1.8-alt0.4:sisyphus_riscv64+98769.100.1.1 at 1761640977
[riscv64] MI2a: target SELECTED: llvm20.1 20.1.8-alt0.4:sisyphus_riscv64+98769.100.1.1 at 1761640977
[riscv64] MI2a: requesting to install llvm20.1 (unspec'd ver; inspect with Debug::pkgMark-shallow)
[riscv64] MI2a: marked for install (shallow): llvm20.1
[riscv64] MI2a: satisfying Depends: libclang-cpp20 = 20.1.8-alt0.4:sisyphus_riscv64+98769.100.1.1
[riscv64] MI2a: maybe install (a direct target): libclang-cpp20 20.1.8-alt0.4:sisyphus_riscv64+98769.100.1.1 at 1761640977
[riscv64] MI2a: target SELECTED: libclang-cpp20 20.1.8-alt0.4:sisyphus_riscv64+98769.100.1.1 at 1761640977
[riscv64] MI2a: requesting to install libclang-cpp20 (unspec'd ver; inspect with Debug::pkgMark-shallow)
[riscv64] MI2a: marked for install (shallow): libclang-cpp20
[riscv64] MI2a: satisfying Depends: llvm20.1-libs = 20.1.8-alt0.4:sisyphus_riscv64+98769.100.1.1
[riscv64] MI2a: maybe install (a direct target): llvm20.1-libs 20.1.8-alt0.4:sisyphus_riscv64+98769.100.1.1 at 1761640977
[riscv64] MI2a: target SELECTED: llvm20.1-libs 20.1.8-alt0.4:sisyphus_riscv64+98769.100.1.1 at 1761640977
[riscv64] MI2a: requesting to install llvm20.1-libs (unspec'd ver; inspect with Debug::pkgMark-shallow)
[riscv64] MI2a: marked for install (shallow): llvm20.1-libs
[riscv64] MI2a: satisfying Depends: llvm20.1-gold = 20.1.8-alt0.4:sisyphus_riscv64+98769.100.1.1
[riscv64] MI2a: maybe install (a direct target): llvm20.1-gold 20.1.8-alt0.4:sisyphus_riscv64+98769.100.1.1 at 1761640977
[riscv64] MI2a: target SELECTED: llvm20.1-gold 20.1.8-alt0.4:sisyphus_riscv64+98769.100.1.1 at 1761640977
[riscv64] MI2a: requesting to install llvm20.1-gold (unspec'd ver; inspect with Debug::pkgMark-shallow)
[riscv64] MI2a: marked for install (shallow): llvm20.1-gold
[riscv64] MI2a: satisfying Depends: llvm20.1-polly = 20.1.8-alt0.4:sisyphus_riscv64+98769.100.1.1
[riscv64] MI2a: maybe install (a direct target): llvm20.1-polly 20.1.8-alt0.4:sisyphus_riscv64+98769.100.1.1 at 1761640977
[riscv64] MI2a: target SELECTED: llvm20.1-polly 20.1.8-alt0.4:sisyphus_riscv64+98769.100.1.1 at 1761640977
[riscv64] MI2a: requesting to install llvm20.1-polly (unspec'd ver; inspect with Debug::pkgMark-shallow)
[riscv64] MI2a: marked for install (shallow): llvm20.1-polly
[riscv64] MI2a: satisfying Depends: llvm20.1-filesystem = 20.1.8-alt0.4:sisyphus_riscv64+98769.100.1.1
[riscv64] MI2a: maybe install (a direct target): llvm20.1-filesystem 20.1.8-alt0.4:sisyphus_riscv64+98769.100.1.1 at 1761640977
[riscv64] MI2a: target SELECTED: llvm20.1-filesystem 20.1.8-alt0.4:sisyphus_riscv64+98769.100.1.1 at 1761640977
[riscv64] MI2a: requesting to install llvm20.1-filesystem (unspec'd ver; inspect with Debug::pkgMark-shallow)
[riscv64] MI2a: marked for install (shallow): llvm20.1-filesystem
[riscv64] MI2a: satisfying Depends: clang20.1-devel (NULL)
[riscv64] MI2a: maybe install (a direct target): clang20.1-devel 20.1.8-alt0.4:sisyphus_riscv64+98769.100.1.1 at 1761640977
[riscv64] MI2a: target SELECTED: clang20.1-devel 20.1.8-alt0.4:sisyphus_riscv64+98769.100.1.1 at 1761640977
[riscv64] MI2a: requesting to install clang20.1-devel (unspec'd ver; inspect with Debug::pkgMark-shallow)
[riscv64] MI2a: marked for install (shallow): clang20.1-devel
[riscv64] MI2a: satisfying Depends: clang-devel >= 19.1
[riscv64] MI2a: maybe install (a direct target): clang-devel 21.1.0-alt0.port:sisyphus_riscv64+116396.100.1.1 at 1774506530
[riscv64] MI2a: target SELECTED: clang-devel 21.1.0-alt0.port:sisyphus_riscv64+116396.100.1.1 at 1774506530
[riscv64] MI2a: requesting to install clang-devel (unspec'd ver; inspect with Debug::pkgMark-shallow)
[riscv64] MI2a: marked for install (shallow): clang-devel
[riscv64] MI2a: satisfying Depends: clang21.1-devel (NULL)
[riscv64] MI2a: maybe install (a direct target): clang21.1-devel 21.1.8-alt0.2:sisyphus_riscv64+105756.100.1.1 at 1767141832
[riscv64] MI2a: target SELECTED: clang21.1-devel 21.1.8-alt0.2:sisyphus_riscv64+105756.100.1.1 at 1767141832
[riscv64] MI2a: requesting to install clang21.1-devel (unspec'd ver; inspect with Debug::pkgMark-shallow)
[riscv64] MI2a: marked for install (shallow): clang21.1-devel
[riscv64] MI2a: satisfying Depends: clang21.1 = 21.1.8-alt0.2:sisyphus_riscv64+105756.100.1.1
[riscv64] MI2a: maybe install (a direct target): clang21.1 21.1.8-alt0.2:sisyphus_riscv64+105756.100.1.1 at 1767141832
[riscv64] MI2a: target SELECTED: clang21.1 21.1.8-alt0.2:sisyphus_riscv64+105756.100.1.1 at 1767141832
[riscv64] MI2a: requesting to install clang21.1 (unspec'd ver; inspect with Debug::pkgMark-shallow)
[riscv64] MI2a: marked for install (shallow): clang21.1
[riscv64] MI2a: satisfying Depends: clang >= 20.1
[riscv64] MI2a: maybe install (a direct target): clang 21.1.0-alt0.port:sisyphus_riscv64+116396.100.1.1 at 1774506530
[riscv64] MI2a: target SELECTED: clang 21.1.0-alt0.port:sisyphus_riscv64+116396.100.1.1 at 1774506530
[riscv64] MI2a: requesting to install clang (unspec'd ver; inspect with Debug::pkgMark-shallow)
[riscv64] MI2a: marked for install (shallow): clang
[riscv64] MI2a: satisfying Depends: clang21.1-support = 21.1.8-alt0.2:sisyphus_riscv64+105756.100.1.1
[riscv64] MI2a: maybe install (a direct target): clang21.1-support 21.1.8-alt0.2:sisyphus_riscv64+105756.100.1.1 at 1767141832
[riscv64] MI2a: target SELECTED: clang21.1-support 21.1.8-alt0.2:sisyphus_riscv64+105756.100.1.1 at 1767141832
[riscv64] MI2a: requesting to install clang21.1-support (unspec'd ver; inspect with Debug::pkgMark-shallow)
[riscv64] MI2a: marked for install (shallow): clang21.1-support
[riscv64] MI2a: satisfying Depends: libclang21 = 21.1.8-alt0.2:sisyphus_riscv64+105756.100.1.1
[riscv64] MI2a: maybe install (a direct target): libclang21 21.1.8-alt0.2:sisyphus_riscv64+105756.100.1.1 at 1767141832
[riscv64] MI2a: target SELECTED: libclang21 21.1.8-alt0.2:sisyphus_riscv64+105756.100.1.1 at 1767141832
[riscv64] MI2a: requesting to install libclang21 (unspec'd ver; inspect with Debug::pkgMark-shallow)
[riscv64] MI2a: marked for install (shallow): libclang21
[riscv64] MI2a: satisfying Depends: clang20.1 = 20.1.8-alt0.4:sisyphus_riscv64+98769.100.1.1
[riscv64] MI2a: maybe install (a direct target): clang20.1 20.1.8-alt0.4:sisyphus_riscv64+98769.100.1.1 at 1761640977
[riscv64] MI2a: target SELECTED: clang20.1 20.1.8-alt0.4:sisyphus_riscv64+98769.100.1.1 at 1761640977
[riscv64] MI2a: requesting to install clang20.1 (unspec'd ver; inspect with Debug::pkgMark-shallow)
[riscv64] MI2a: marked for install (shallow): clang20.1
[riscv64] MI2a: satisfying Depends: clang20.1-support = 20.1.8-alt0.4:sisyphus_riscv64+98769.100.1.1
[riscv64] MI2a: maybe install (a direct target): clang20.1-support 20.1.8-alt0.4:sisyphus_riscv64+98769.100.1.1 at 1761640977
[riscv64] MI2a: target SELECTED: clang20.1-support 20.1.8-alt0.4:sisyphus_riscv64+98769.100.1.1 at 1761640977
[riscv64] MI2a: requesting to install clang20.1-support (unspec'd ver; inspect with Debug::pkgMark-shallow)
[riscv64] MI2a: marked for install (shallow): clang20.1-support
[riscv64] MI2a: satisfying Depends: libclang20 = 20.1.8-alt0.4:sisyphus_riscv64+98769.100.1.1
[riscv64] MI2a: maybe install (a direct target): libclang20 20.1.8-alt0.4:sisyphus_riscv64+98769.100.1.1 at 1761640977
[riscv64] MI2a: target SELECTED: libclang20 20.1.8-alt0.4:sisyphus_riscv64+98769.100.1.1 at 1761640977
[riscv64] MI2a: requesting to install libclang20 (unspec'd ver; inspect with Debug::pkgMark-shallow)
[riscv64] MI2a: marked for install (shallow): libclang20
[riscv64] MI2a: satisfying Depends: libecpg6-18-devel = 18.3-alt2:sisyphus_riscv64+115682.100.1.1
[riscv64] MI2a: maybe install (a direct target): libecpg6-18-devel 18.3-alt2:sisyphus_riscv64+115682.100.1.1 at 1774051756
[riscv64] MI2a: target SELECTED: libecpg6-18-devel 18.3-alt2:sisyphus_riscv64+115682.100.1.1 at 1774051756
[riscv64] MI2a: requesting to install libecpg6-18-devel (unspec'd ver; inspect with Debug::pkgMark-shallow)
[riscv64] MI2a: marked for install (shallow): libecpg6-18-devel
[riscv64] MI2a: satisfying Depends: libecpg6-18 = 18.3-alt2:sisyphus_riscv64+115682.100.1.1
[riscv64] MI2a: maybe install (a direct target): libecpg6-18 18.3-alt2:sisyphus_riscv64+115682.100.1.1 at 1774051756
[riscv64] MI2a: target SELECTED: libecpg6-18 18.3-alt2:sisyphus_riscv64+115682.100.1.1 at 1774051756
[riscv64] MI2a: requesting to install libecpg6-18 (unspec'd ver; inspect with Debug::pkgMark-shallow)
[riscv64] MI2a: marked for install (shallow): libecpg6-18
[riscv64] MI2a: satisfying Depends: libpq5-18-devel = 18.3-alt2:sisyphus_riscv64+115682.100.1.1
[riscv64] MI2a: maybe install (a direct target): libpq5-18-devel 18.3-alt2:sisyphus_riscv64+115682.100.1.1 at 1774051756
[riscv64] MI2a: target SELECTED: libpq5-18-devel 18.3-alt2:sisyphus_riscv64+115682.100.1.1 at 1774051756
[riscv64] MI2a: requesting to install libpq5-18-devel (unspec'd ver; inspect with Debug::pkgMark-shallow)
[riscv64] MI2a: marked for install (shallow): libpq5-18-devel
[riscv64] MI2a: satisfying Depends: libpq5-18 = 18.3-alt2:sisyphus_riscv64+115682.100.1.1
[riscv64] MI2a: maybe install (a direct target): libpq5-18 18.3-alt2:sisyphus_riscv64+115682.100.1.1 at 1774051756
[riscv64] MI2a: target SELECTED: libpq5-18 18.3-alt2:sisyphus_riscv64+115682.100.1.1 at 1774051756
[riscv64] MI2a: requesting to install libpq5-18 (unspec'd ver; inspect with Debug::pkgMark-shallow)
[riscv64] MI2a: marked for install (shallow): libpq5-18
[riscv64] MI2a: marked for install (shallow): swig
[riscv64] MI2a: satisfying Depends: swig-data = 1:4.3.1-alt1:sisyphus_riscv64+90227.100.1.2
[riscv64] MI2a: maybe install (a direct target): swig-data 1:4.3.1-alt1:sisyphus_riscv64+90227.100.1.2 at 1753305163
[riscv64] MI2a: target SELECTED: swig-data 1:4.3.1-alt1:sisyphus_riscv64+90227.100.1.2 at 1753305163
[riscv64] MI2a: requesting to install swig-data (unspec'd ver; inspect with Debug::pkgMark-shallow)
[riscv64] MI2a: marked for install (shallow): swig-data
[riscv64] MI2a: satisfying Depends: perl(ExtUtils/MakeMaker.pm) (NULL)
[riscv64] MI2a: maybe install (a providing target): perl-devel 1:5.38.4-alt3:sisyphus_riscv64+94109.100.1.1 at 1757011149
[riscv64] MI2a: target SELECTED: perl-devel 1:5.38.4-alt3:sisyphus_riscv64+94109.100.1.1 at 1757011149
[riscv64] MI2a: requesting to install perl-devel (unspec'd ver; inspect with Debug::pkgMark-shallow)
[riscv64] MI2a: marked for install (shallow): perl-devel
[riscv64] MI2a: satisfying Depends: libgdbm-devel (NULL)
[riscv64] MI2a: maybe install (a direct target): libgdbm-devel 1.8.3-alt10:sisyphus_riscv64+49324.100.1.1 at 1716585564
[riscv64] MI2a: target SELECTED: libgdbm-devel 1.8.3-alt10:sisyphus_riscv64+49324.100.1.1 at 1716585564
[riscv64] MI2a: requesting to install libgdbm-devel (unspec'd ver; inspect with Debug::pkgMark-shallow)
[riscv64] MI2a: marked for install (shallow): libgdbm-devel
[riscv64] MI2a: satisfying Depends: libgdbm = 1.8.3-alt10:sisyphus_riscv64+49324.100.1.1
[riscv64] MI2a: maybe install (a direct target): libgdbm 1.8.3-alt10:sisyphus_riscv64+49324.100.1.1 at 1716585564
[riscv64] MI2a: target SELECTED: libgdbm 1.8.3-alt10:sisyphus_riscv64+49324.100.1.1 at 1716585564
[riscv64] MI2a: requesting to install libgdbm (unspec'd ver; inspect with Debug::pkgMark-shallow)
[riscv64] MI2a: marked for install (shallow): libgdbm
[riscv64] MI2a: marked for install (shallow): libnetcdf-devel
[riscv64] MI2a: satisfying Depends: libnetcdf22 = 4.9.3-alt2:sisyphus_riscv64+107079.100.1.1
[riscv64] MI2a: maybe install (a direct target): libnetcdf22 4.9.3-alt2:sisyphus_riscv64+107079.100.1.1 at 1768734219
[riscv64] MI2a: target SELECTED: libnetcdf22 4.9.3-alt2:sisyphus_riscv64+107079.100.1.1 at 1768734219
[riscv64] MI2a: requesting to install libnetcdf22 (unspec'd ver; inspect with Debug::pkgMark-shallow)
[riscv64] MI2a: marked for install (shallow): libnetcdf22
[riscv64] MI2a: marked for install (shallow): libproj-devel
[riscv64] MI2a: satisfying Depends: libproj = 9.4.0-alt1:sisyphus_riscv64+81130.11500.4.1
[riscv64] MI2a: maybe install (a direct target): libproj 9.4.0-alt1:sisyphus_riscv64+81130.11500.4.1 at 1745616793
[riscv64] MI2a: target SELECTED: libproj 9.4.0-alt1:sisyphus_riscv64+81130.11500.4.1 at 1745616793
[riscv64] MI2a: requesting to install libproj (unspec'd ver; inspect with Debug::pkgMark-shallow)
[riscv64] MI2a: marked for install (shallow): libproj
[riscv64] MI2a: satisfying Depends: libtiff.so.6()(64bit) >= set:lhm4Ov3zNRX1BAeYBPuNO20uQOJDAxH41kFtz43
[riscv64] MI2a: maybe install (a providing target): libtiff6 4.7.1-alt1:sisyphus_riscv64+95658.100.1.1 at 1758293667
[riscv64] MI2a: target SELECTED: libtiff6 4.7.1-alt1:sisyphus_riscv64+95658.100.1.1 at 1758293667
[riscv64] MI2a: requesting to install libtiff6 (unspec'd ver; inspect with Debug::pkgMark-shallow)
[riscv64] MI2a: marked for install (shallow): libtiff6
[riscv64] MI2a: satisfying Depends: libdeflate.so.0()(64bit) >= set:ifCEnhV7c75unfGi0p
[riscv64] MI2a: maybe install (a providing target): libdeflate 1.25-alt1:sisyphus_riscv64+99584.100.1.1 at 1762106009
[riscv64] MI2a: target SELECTED: libdeflate 1.25-alt1:sisyphus_riscv64+99584.100.1.1 at 1762106009
[riscv64] MI2a: requesting to install libdeflate (unspec'd ver; inspect with Debug::pkgMark-shallow)
[riscv64] MI2a: marked for install (shallow): libdeflate
[riscv64] MI2a: satisfying Depends: libwebp.so.7()(64bit) >= set:kfeybVebvbq98FOogoMMZc91uql30oRiYPt56YEea
[riscv64] MI2a: maybe install (a providing target): libwebp7 1.6.0-alt1.1:sisyphus_riscv64+91429.100.1.1 at 1754536805
[riscv64] MI2a: target SELECTED: libwebp7 1.6.0-alt1.1:sisyphus_riscv64+91429.100.1.1 at 1754536805
[riscv64] MI2a: requesting to install libwebp7 (unspec'd ver; inspect with Debug::pkgMark-shallow)
[riscv64] MI2a: marked for install (shallow): libwebp7
[riscv64] MI2a: marked for install (shallow): libxerces-c-devel
[riscv64] MI2a: satisfying Depends: libxerces-c-3.3 = 3.3.0-alt1:sisyphus_riscv64+114680.200.1.1
[riscv64] MI2a: maybe install (a direct target): libxerces-c-3.3 3.3.0-alt1:sisyphus_riscv64+114680.200.1.1 at 1773518862
[riscv64] MI2a: target SELECTED: libxerces-c-3.3 3.3.0-alt1:sisyphus_riscv64+114680.200.1.1 at 1773518862
[riscv64] MI2a: requesting to install libxerces-c-3.3 (unspec'd ver; inspect with Debug::pkgMark-shallow)
[riscv64] MI2a: marked for install (shallow): libxerces-c-3.3
[riscv64] MI2a: marked for install (shallow): cmake
[riscv64] MI2a: satisfying Depends: libarchive.so.13()(64bit) >= set:mfws0SCfLRvPUKXi0gkbE0yqsuzVMI88jwJ7kSDXXM11MUSPfvqwmDm2xDogNmeEkAorJTlC2B1ZatQqH4cJ32OndcAjazDxDaNvG6mMdDQthrMI5Ie5skSvbnLedY5O95MlUcFQ1thxqvQWyDvIECoveyzf0x7I3xw6vu1
[riscv64] MI2a: maybe install (a providing target): libarchive13 3.8.5-alt1:sisyphus_riscv64+110011.100.1.1 at 1770695518
[riscv64] MI2a: target SELECTED: libarchive13 3.8.5-alt1:sisyphus_riscv64+110011.100.1.1 at 1770695518
[riscv64] MI2a: requesting to install libarchive13 (unspec'd ver; inspect with Debug::pkgMark-shallow)
[riscv64] MI2a: marked for install (shallow): libarchive13
[riscv64] MI2a: satisfying Depends: libjsoncpp.so.24()(64bit) >= set:mfWdNr9hSTEj33pgekkWiZ5gxiSrhe4i6fCrcyUrA0F5fpZ4CuAAbvZEaLNDQoZ1XGHPAxHVDJ5aZ8J4EOS5Ph9IjMNpQdqYunbBZ41SG8ORLJvBHW7puYYi760ZFTIxHsoUGjwulnr1aj60ioshZ86OzriUK9i3sdbhS3TUeesGtiqSY443ccil09T2sqefesYqfSWyFayk8DyeCwIzPv0
[riscv64] MI2a: maybe install (a providing target): libjsoncpp24 1.9.4-alt2:sisyphus_riscv64+49295.100.1.1 at 1716568573
[riscv64] MI2a: target SELECTED: libjsoncpp24 1.9.4-alt2:sisyphus_riscv64+49295.100.1.1 at 1716568573
[riscv64] MI2a: requesting to install libjsoncpp24 (unspec'd ver; inspect with Debug::pkgMark-shallow)
[riscv64] MI2a: marked for install (shallow): libjsoncpp24
[riscv64] MI2a: satisfying Depends: librhash.so.0()(64bit) >= set:ifDyZ6eqLIBMAAMoeF3
[riscv64] MI2a: maybe install (a providing target): librhash 1.3.5-alt3:sisyphus_riscv64+11373.100.1.1 at 1635835354
[riscv64] MI2a: target SELECTED: librhash 1.3.5-alt3:sisyphus_riscv64+11373.100.1.1 at 1635835354
[riscv64] MI2a: requesting to install librhash (unspec'd ver; inspect with Debug::pkgMark-shallow)
[riscv64] MI2a: marked for install (shallow): librhash
[riscv64] MI2a: satisfying Depends: libuv.so.1()(64bit) >= set:mhRqUeic58tAOj8qzoZvhgcZFirSpyDd3iNFI57V8pPeIZrSvA2qcK8FfNrygsaEqZ6VfZGZvj3
[riscv64] MI2a: maybe install (a providing target): libuv 1.52.1-alt2:sisyphus_riscv64+118402.100.1.1 at 1775741504
[riscv64] MI2a: target SELECTED: libuv 1.52.1-alt2:sisyphus_riscv64+118402.100.1.1 at 1775741504
[riscv64] MI2a: requesting to install libuv (unspec'd ver; inspect with Debug::pkgMark-shallow)
[riscv64] MI2a: marked for install (shallow): libuv
[riscv64] MI2a: satisfying Depends: cmake-modules = 4.2.3-alt1:sisyphus_riscv64+113670.100.1.1
[riscv64] MI2a: maybe install (a direct target): cmake-modules 4.2.3-alt1:sisyphus_riscv64+113670.100.1.1 at 1773073377
[riscv64] MI2a: target SELECTED: cmake-modules 4.2.3-alt1:sisyphus_riscv64+113670.100.1.1 at 1773073377
[riscv64] MI2a: requesting to install cmake-modules (unspec'd ver; inspect with Debug::pkgMark-shallow)
[riscv64] MI2a: marked for install (shallow): cmake-modules
[riscv64] MI2a: marked for install (shallow): python3-dev
[riscv64] MI2a: satisfying Depends: libpython3 = 3.13.12-alt3:sisyphus_riscv64+119616.100.1.1
[riscv64] MI2a: maybe install (a direct target): libpython3 3.13.12-alt3:sisyphus_riscv64+119616.100.1.1 at 1776677221
[riscv64] MI2a: target SELECTED: libpython3 3.13.12-alt3:sisyphus_riscv64+119616.100.1.1 at 1776677221
[riscv64] MI2a: requesting to install libpython3 (unspec'd ver; inspect with Debug::pkgMark-shallow)
[riscv64] MI2a: marked for install (shallow): libpython3
[riscv64] MI2a: marked for install (shallow): python3-module-setuptools
[riscv64] MI2a: satisfying Depends: python3-module-jaraco-functools (NULL)
[riscv64] MI2a: maybe install (a providing target): python3-module-jaraco.functools 4.4.0-alt1:sisyphus_riscv64+104836.100.1.1 at 1766408929
[riscv64] MI2a: target SELECTED: python3-module-jaraco.functools 4.4.0-alt1:sisyphus_riscv64+104836.100.1.1 at 1766408929
[riscv64] MI2a: requesting to install python3-module-jaraco.functools (unspec'd ver; inspect with Debug::pkgMark-shallow)
[riscv64] MI2a: marked for install (shallow): python3-module-jaraco.functools
[riscv64] MI2a: satisfying Depends: python3(more_itertools) < 0
[riscv64] MI2a: maybe install (a providing target): python3-module-more-itertools 11.0.2-alt1:sisyphus_riscv64+118848.100.1.1 at 1776273845
[riscv64] MI2a: target SELECTED: python3-module-more-itertools 11.0.2-alt1:sisyphus_riscv64+118848.100.1.1 at 1776273845
[riscv64] MI2a: requesting to install python3-module-more-itertools (unspec'd ver; inspect with Debug::pkgMark-shallow)
[riscv64] MI2a: marked for install (shallow): python3-module-more-itertools
[riscv64] MI2a: satisfying Depends: python3-module-jaraco-text (NULL)
[riscv64] MI2a: maybe install (a providing target): python3-module-jaraco.text 4.2.0-alt1:sisyphus_riscv64+111212.100.1.1 at 1771626556
[riscv64] MI2a: target SELECTED: python3-module-jaraco.text 4.2.0-alt1:sisyphus_riscv64+111212.100.1.1 at 1771626556
[riscv64] MI2a: requesting to install python3-module-jaraco.text (unspec'd ver; inspect with Debug::pkgMark-shallow)
[riscv64] MI2a: marked for install (shallow): python3-module-jaraco.text
[riscv64] MI2a: satisfying Depends: python3-module-jaraco-context (NULL)
[riscv64] MI2a: maybe install (a providing target): python3-module-jaraco.context 6.1.2-alt1:sisyphus_riscv64+116191.100.1.1 at 1774458248
[riscv64] MI2a: target SELECTED: python3-module-jaraco.context 6.1.2-alt1:sisyphus_riscv64+116191.100.1.1 at 1774458248
[riscv64] MI2a: requesting to install python3-module-jaraco.context (unspec'd ver; inspect with Debug::pkgMark-shallow)
[riscv64] MI2a: marked for install (shallow): python3-module-jaraco.context
[riscv64] MI2a: satisfying Depends: python3-module-typer-slim (NULL)
[riscv64] MI2a: maybe install (a direct target): python3-module-typer-slim 0.24.0-alt2:sisyphus_riscv64+111543.100.1.3 at 1771759528
[riscv64] MI2a: target SELECTED: python3-module-typer-slim 0.24.0-alt2:sisyphus_riscv64+111543.100.1.3 at 1771759528
[riscv64] MI2a: requesting to install python3-module-typer-slim (unspec'd ver; inspect with Debug::pkgMark-shallow)
[riscv64] MI2a: marked for install (shallow): python3-module-typer-slim
[riscv64] MI2a: satisfying Depends: python3-module-typer = 0.24.0-alt2:sisyphus_riscv64+111543.100.1.3
[riscv64] MI2a: maybe install (a direct target): python3-module-typer 0.24.0-alt2:sisyphus_riscv64+111543.100.1.3 at 1771759528
[riscv64] MI2a: target SELECTED: python3-module-typer 0.24.0-alt2:sisyphus_riscv64+111543.100.1.3 at 1771759528
[riscv64] MI2a: requesting to install python3-module-typer (unspec'd ver; inspect with Debug::pkgMark-shallow)
[riscv64] MI2a: marked for install (shallow): python3-module-typer
[riscv64] MI2a: satisfying Depends: python3-module-annotated-doc (NULL)
[riscv64] MI2a: maybe install (a providing target): python3-module-annotated_doc 0.0.4-alt1:sisyphus_riscv64+102252.100.1.1 at 1764447695
[riscv64] MI2a: target SELECTED: python3-module-annotated_doc 0.0.4-alt1:sisyphus_riscv64+102252.100.1.1 at 1764447695
[riscv64] MI2a: requesting to install python3-module-annotated_doc (unspec'd ver; inspect with Debug::pkgMark-shallow)
[riscv64] MI2a: marked for install (shallow): python3-module-annotated_doc
[riscv64] MI2a: satisfying Depends: python3-module-click (NULL)
[riscv64] MI2a: maybe install (a direct target): python3-module-click 8.3.2-alt1:sisyphus_riscv64+118249.100.1.1 at 1775687343
[riscv64] MI2a: target SELECTED: python3-module-click 8.3.2-alt1:sisyphus_riscv64+118249.100.1.1 at 1775687343
[riscv64] MI2a: requesting to install python3-module-click (unspec'd ver; inspect with Debug::pkgMark-shallow)
[riscv64] MI2a: marked for install (shallow): python3-module-click
[riscv64] MI2a: satisfying Depends: python3-module-rich (NULL)
[riscv64] MI2a: maybe install (a direct target): python3-module-rich 15.0.0-alt1:sisyphus_riscv64+119050.100.1.1 at 1776324666
[riscv64] MI2a: target SELECTED: python3-module-rich 15.0.0-alt1:sisyphus_riscv64+119050.100.1.1 at 1776324666
[riscv64] MI2a: requesting to install python3-module-rich (unspec'd ver; inspect with Debug::pkgMark-shallow)
[riscv64] MI2a: marked for install (shallow): python3-module-rich
[riscv64] MI2a: satisfying Depends: python3-module-markdown-it-py (NULL)
[riscv64] MI2a: maybe install (a providing target): python3-module-markdown-it 4.0.0-alt1:sisyphus_riscv64+94422.100.1.1 at 1757347017
[riscv64] MI2a: target SELECTED: python3-module-markdown-it 4.0.0-alt1:sisyphus_riscv64+94422.100.1.1 at 1757347017
[riscv64] MI2a: requesting to install python3-module-markdown-it (unspec'd ver; inspect with Debug::pkgMark-shallow)
[riscv64] MI2a: marked for install (shallow): python3-module-markdown-it
[riscv64] MI2a: satisfying Depends: python3-module-mdurl (NULL)
[riscv64] MI2a: maybe install (a direct target): python3-module-mdurl 0.1.2-alt1:sisyphus_riscv64+32107.1000.2.1 at 1683309157
[riscv64] MI2a: target SELECTED: python3-module-mdurl 0.1.2-alt1:sisyphus_riscv64+32107.1000.2.1 at 1683309157
[riscv64] MI2a: requesting to install python3-module-mdurl (unspec'd ver; inspect with Debug::pkgMark-shallow)
[riscv64] MI2a: marked for install (shallow): python3-module-mdurl
[riscv64] MI2a: satisfying Depends: python3(linkify_it) < 0
[riscv64] MI2a: maybe install (a providing target): python3-module-linkify-it-py 2.1.0-alt1.1:sisyphus_riscv64+116933.100.1.1 at 1774852211
[riscv64] MI2a: target SELECTED: python3-module-linkify-it-py 2.1.0-alt1.1:sisyphus_riscv64+116933.100.1.1 at 1774852211
[riscv64] MI2a: requesting to install python3-module-linkify-it-py (unspec'd ver; inspect with Debug::pkgMark-shallow)
[riscv64] MI2a: marked for install (shallow): python3-module-linkify-it-py
[riscv64] MI2a: satisfying Depends: python3(uc_micro.categories) < 0
[riscv64] MI2a: maybe install (a providing target): python3-module-uc-micro-py 2.0.0-alt1:sisyphus_riscv64+114686.100.1.1 at 1773520342
[riscv64] MI2a: target SELECTED: python3-module-uc-micro-py 2.0.0-alt1:sisyphus_riscv64+114686.100.1.1 at 1773520342
[riscv64] MI2a: requesting to install python3-module-uc-micro-py (unspec'd ver; inspect with Debug::pkgMark-shallow)
[riscv64] MI2a: marked for install (shallow): python3-module-uc-micro-py
[riscv64] MI2a: satisfying Depends: python3(typing_extensions) < 0
[riscv64] MI2a: maybe install (a providing target): python3-module-typing_extensions 4.15.0-alt2:sisyphus_riscv64+100533.100.1.1 at 1763069395
[riscv64] MI2a: target SELECTED: python3-module-typing_extensions 4.15.0-alt2:sisyphus_riscv64+100533.100.1.1 at 1763069395
[riscv64] MI2a: requesting to install python3-module-typing_extensions (unspec'd ver; inspect with Debug::pkgMark-shallow)
[riscv64] MI2a: marked for install (shallow): python3-module-typing_extensions
[riscv64] MI2a: satisfying Depends: python3-module-pygments (NULL)
[riscv64] MI2a: maybe install (a providing target): python3-module-Pygments 2.20.0-alt1:sisyphus_riscv64+117973.100.1.1 at 1775513420
[riscv64] MI2a: target SELECTED: python3-module-Pygments 2.20.0-alt1:sisyphus_riscv64+117973.100.1.1 at 1775513420
[riscv64] MI2a: requesting to install python3-module-Pygments (unspec'd ver; inspect with Debug::pkgMark-shallow)
[riscv64] MI2a: marked for install (shallow): python3-module-Pygments
[riscv64] MI2a: satisfying Depends: python3-module-shellingham (NULL)
[riscv64] MI2a: maybe install (a direct target): python3-module-shellingham 1.5.4-alt1:sisyphus_riscv64+39696.100.1.1 at 1698254854
[riscv64] MI2a: target SELECTED: python3-module-shellingham 1.5.4-alt1:sisyphus_riscv64+39696.100.1.1 at 1698254854
[riscv64] MI2a: requesting to install python3-module-shellingham (unspec'd ver; inspect with Debug::pkgMark-shallow)
[riscv64] MI2a: marked for install (shallow): python3-module-shellingham
[riscv64] MI2a: satisfying Depends: python3-module-packaging (NULL)
[riscv64] MI2a: maybe install (a direct target): python3-module-packaging 26.1-alt1:sisyphus_riscv64+120264.100.1.1 at 1778145924
[riscv64] MI2a: target SELECTED: python3-module-packaging 26.1-alt1:sisyphus_riscv64+120264.100.1.1 at 1778145924
[riscv64] MI2a: requesting to install python3-module-packaging (unspec'd ver; inspect with Debug::pkgMark-shallow)
[riscv64] MI2a: marked for install (shallow): python3-module-packaging
[riscv64] MI2a: satisfying Depends: python3-module-wheel (NULL)
[riscv64] MI2a: maybe install (a direct target): python3-module-wheel 0.47.0-alt1:sisyphus_riscv64+120561.100.1.1 at 1778210280
[riscv64] MI2a: target SELECTED: python3-module-wheel 0.47.0-alt1:sisyphus_riscv64+120561.100.1.1 at 1778210280
[riscv64] MI2a: requesting to install python3-module-wheel (unspec'd ver; inspect with Debug::pkgMark-shallow)
[riscv64] MI2a: marked for install (shallow): python3-module-wheel
[riscv64] MI2a: satisfying Depends: python3-module-pkg-resources >= 1:80.10.2-alt2
[riscv64] MI2a: maybe install (a direct target): python3-module-pkg-resources 1:80.10.2-alt2.1:sisyphus_riscv64+116967.1000.1.2 at 1774892878
[riscv64] MI2a: target SELECTED: python3-module-pkg-resources 1:80.10.2-alt2.1:sisyphus_riscv64+116967.1000.1.2 at 1774892878
[riscv64] MI2a: requesting to install python3-module-pkg-resources (unspec'd ver; inspect with Debug::pkgMark-shallow)
[riscv64] MI2a: marked for install (shallow): python3-module-pkg-resources
[riscv64] MI2a: satisfying Depends: python3(platformdirs) < 0
[riscv64] MI2a: maybe install (a providing target): python3-module-platformdirs 4.9.6-alt1:sisyphus_riscv64+118605.100.1.1 at 1776122067
[riscv64] MI2a: target SELECTED: python3-module-platformdirs 4.9.6-alt1:sisyphus_riscv64+118605.100.1.1 at 1776122067
[riscv64] MI2a: requesting to install python3-module-platformdirs (unspec'd ver; inspect with Debug::pkgMark-shallow)
[riscv64] MI2a: marked for install (shallow): python3-module-platformdirs
[riscv64] MI2a: marked for install (shallow): libnumpy-py3-devel
[riscv64] MI2a: satisfying Depends: python3-module-numpy = 1:2.4.2-alt2:sisyphus_riscv64+110785.100.1.1
[riscv64] MI2a: maybe install (a direct target): python3-module-numpy 1:2.4.2-alt2:sisyphus_riscv64+110785.100.1.1 at 1771247921
[riscv64] MI2a: target SELECTED: python3-module-numpy 1:2.4.2-alt2:sisyphus_riscv64+110785.100.1.1 at 1771247921
[riscv64] MI2a: requesting to install python3-module-numpy (unspec'd ver; inspect with Debug::pkgMark-shallow)
[riscv64] MI2a: marked for install (shallow): python3-module-numpy
[riscv64] MI2a: satisfying Depends: liblapack.so.4()(64bit) >= set:ojHKUptFIKqhToPKEDZbDNEOgKZarbNzKM9HZ9OfUNSOo2tR6upPkSTHhaJ9zfmzkLehkw32XjvYkgMjqZ50bN7lxFXZxb
[riscv64] MI2a: maybe install (a providing target): liblapack3 1:3.8.0-alt10:sisyphus_riscv64+118983.100.1.1 at 1776315497
[riscv64] MI2a: target SELECTED: liblapack3 1:3.8.0-alt10:sisyphus_riscv64+118983.100.1.1 at 1776315497
[riscv64] MI2a: requesting to install liblapack3 (unspec'd ver; inspect with Debug::pkgMark-shallow)
[riscv64] MI2a: marked for install (shallow): liblapack3
[riscv64] MI2a: satisfying Depends: libgfortran.so.5()(64bit) >= set:okAaMj4uBKwhkPdBq1vi1pzFEFsaZdFwca
[riscv64] MI2a: maybe install (a providing target): libgfortran5 14.3.1-alt0.port.2:sisyphus_riscv64+98534.200.1.1 at 1761243914
[riscv64] MI2a: target SELECTED: libgfortran5 14.3.1-alt0.port.2:sisyphus_riscv64+98534.200.1.1 at 1761243914
[riscv64] MI2a: requesting to install libgfortran5 (unspec'd ver; inspect with Debug::pkgMark-shallow)
[riscv64] MI2a: marked for install (shallow): libgfortran5
[riscv64] MI2a: satisfying Depends: libopenblas.so.0()(64bit) >= set:og02f1UkLDLZKJDji2QdFE96MUeFKtJdMjGZF17H3ZpfKa2aQUI9qmlCuDi8Mx15YHv2ypZv1pQew7flFXVUKw7omXQgw699mSegGZumoG3oEE6f02R5MOBZzYE1WLsrbQt1IZeESTVzKvW3ZFjnRuZli3vvdJD60cI33tkrHPWw6t5PmFDSg3XZbQaq5NuRf8DNS1MZx9kz9SxPOlX3Xbo0T0gvIlZBInR9IBwccM0RejobKf215VZ87kb6XSxuwI5ppGwUZi3ZpDyJODrucstN0U1Qt6rUybigL4RWRIw9zxWpoZHSlm7HlBUAzjmNEmVQoqFqVZkXIS95HnIpjIZq2MGO
[riscv64] MI2a: maybe install (a providing target): libopenblas 0.3.33-alt1:sisyphus_riscv64+120425.100.1.1 at 1778201187
[riscv64] MI2a: target SELECTED: libopenblas 0.3.33-alt1:sisyphus_riscv64+120425.100.1.1 at 1778201187
[riscv64] MI2a: requesting to install libopenblas (unspec'd ver; inspect with Debug::pkgMark-shallow)
[riscv64] MI2a: marked for install (shallow): libopenblas
[riscv64] MI2a: satisfying Depends: libxblas.so.0()(64bit) >= set:niNDETaaGg2ibbI86epWXK05U785Uq6VIIAwIh851eJRZ6UtoWfmbnZgff47CVapOrlbjQsKgarQ5cD09
[riscv64] MI2a: maybe install (a providing target): libxblas 1.0.248-alt2:sisyphus_riscv64+11145.100.1.1 at 1635760020
[riscv64] MI2a: target SELECTED: libxblas 1.0.248-alt2:sisyphus_riscv64+11145.100.1.1 at 1635760020
[riscv64] MI2a: requesting to install libxblas (unspec'd ver; inspect with Debug::pkgMark-shallow)
[riscv64] MI2a: marked for install (shallow): libxblas
[riscv64] MI2a: marked for install (shallow): libgeotiff-devel
[riscv64] MI2a: satisfying Depends: libgeotiff5 = 1.6.0-alt2:sisyphus_riscv64+81130.10200.4.1
[riscv64] MI2a: maybe install (a direct target): libgeotiff5 1.6.0-alt2:sisyphus_riscv64+81130.10200.4.1 at 1745603888
[riscv64] MI2a: target SELECTED: libgeotiff5 1.6.0-alt2:sisyphus_riscv64+81130.10200.4.1 at 1745603888
[riscv64] MI2a: requesting to install libgeotiff5 (unspec'd ver; inspect with Debug::pkgMark-shallow)
[riscv64] MI2a: marked for install (shallow): libgeotiff5
[riscv64] MI2a: marked for install (shallow): libqhull-devel
[riscv64] MI2a: satisfying Depends: libqhullcpp8.0 = 2020.2-alt4:sisyphus_riscv64+107180.100.1.1
[riscv64] MI2a: maybe install (a direct target): libqhullcpp8.0 2020.2-alt4:sisyphus_riscv64+107180.100.1.1 at 1768816294
[riscv64] MI2a: target SELECTED: libqhullcpp8.0 2020.2-alt4:sisyphus_riscv64+107180.100.1.1 at 1768816294
[riscv64] MI2a: requesting to install libqhullcpp8.0 (unspec'd ver; inspect with Debug::pkgMark-shallow)
[riscv64] MI2a: marked for install (shallow): libqhullcpp8.0
[riscv64] MI2a: satisfying Depends: libqhull_r8.0 = 2020.2-alt4:sisyphus_riscv64+107180.100.1.1
[riscv64] MI2a: maybe install (a direct target): libqhull_r8.0 2020.2-alt4:sisyphus_riscv64+107180.100.1.1 at 1768816294
[riscv64] MI2a: target SELECTED: libqhull_r8.0 2020.2-alt4:sisyphus_riscv64+107180.100.1.1 at 1768816294
[riscv64] MI2a: requesting to install libqhull_r8.0 (unspec'd ver; inspect with Debug::pkgMark-shallow)
[riscv64] MI2a: marked for install (shallow): libqhull_r8.0
[riscv64] MI2a: marked for install (shallow): libspatialite-devel
[riscv64] MI2a: satisfying Depends: libspatialite = 5.0.1-alt1:sisyphus_riscv64+28745.100.1.1
[riscv64] MI2a: maybe install (a direct target): libspatialite 5.0.1-alt1:sisyphus_riscv64+28745.100.1.1 at 1674744728
[riscv64] MI2a: target SELECTED: libspatialite 5.0.1-alt1:sisyphus_riscv64+28745.100.1.1 at 1674744728
[riscv64] MI2a: requesting to install libspatialite (unspec'd ver; inspect with Debug::pkgMark-shallow)
[riscv64] MI2a: marked for install (shallow): libspatialite
[riscv64] MI2a: satisfying Depends: libfreexl.so.1()(64bit) >= set:hePQHoErZ3WtNGZEG0
[riscv64] MI2a: maybe install (a providing target): freexl 2.0.0-alt1:sisyphus_riscv64+38904.100.1.1 at 1696703345
[riscv64] MI2a: target SELECTED: freexl 2.0.0-alt1:sisyphus_riscv64+38904.100.1.1 at 1696703345
[riscv64] MI2a: requesting to install freexl (unspec'd ver; inspect with Debug::pkgMark-shallow)
[riscv64] MI2a: marked for install (shallow): freexl
[riscv64] MI2a: satisfying Depends: libminizip.so.1()(64bit) >= set:jfVaNQdxFdPyRKiZhj22k7M0
[riscv64] MI2a: maybe install (a providing target): libminizip 1.3.1-alt1:sisyphus_riscv64+45939.100.1.1 at 1710445788
[riscv64] MI2a: target SELECTED: libminizip 1.3.1-alt1:sisyphus_riscv64+45939.100.1.1 at 1710445788
[riscv64] MI2a: requesting to install libminizip (unspec'd ver; inspect with Debug::pkgMark-shallow)
[riscv64] MI2a: marked for install (shallow): libminizip
[riscv64] MI2a: satisfying Depends: librttopo.so.1()(64bit) >= set:ngpLg36na1mSFFnM6zk4fmFGppQpEYZrF6dMUkL1cHAZtNAariAlhMtbHBhZmjKUnK4dTrxl2xEpYTZfyvWpi8ZEKyvD55B0DGhOoETUZqXXguryZK4jDa4XoqyppLImPQV8ESZ1F0UvTVEEwkRZ1wBAeTFRQALyilay2vZDIEh0gu2xrUXnQpX01UTN2tk4Dva6dY5OvhRU6
[riscv64] MI2a: maybe install (a providing target): librttopo 1.1.0-alt1:sisyphus_riscv64+28736.100.1.1 at 1674738282
[riscv64] MI2a: target SELECTED: librttopo 1.1.0-alt1:sisyphus_riscv64+28736.100.1.1 at 1674738282
[riscv64] MI2a: requesting to install librttopo (unspec'd ver; inspect with Debug::pkgMark-shallow)
[riscv64] MI2a: marked for install (shallow): librttopo
[riscv64] MI2a: marked for install (shallow): librasterlite2-devel
[riscv64] MI2a: satisfying Depends: librasterlite2 = 1.1.0-alt1.1:sisyphus_riscv64+81130.11600.4.1
[riscv64] MI2a: maybe install (a direct target): librasterlite2 1.1.0-alt1.1:sisyphus_riscv64+81130.11600.4.1 at 1745617121
[riscv64] MI2a: target SELECTED: librasterlite2 1.1.0-alt1.1:sisyphus_riscv64+81130.11600.4.1 at 1745617121
[riscv64] MI2a: requesting to install librasterlite2 (unspec'd ver; inspect with Debug::pkgMark-shallow)
[riscv64] MI2a: marked for install (shallow): librasterlite2
[riscv64] MI2a: satisfying Depends: libcairo.so.2()(64bit) >= set:mfatAp2k4HHfq2EcAudKXXey5FLKpDyUANyC5PjHX1ZwgACYSNjGFMnqT712OwS6S6vZJH0pkWvguXfVjuRpG7D3ZAtrgNtQItmVx7bMj1WCY9Nv0kA3gXsszwr4SZhanf9Z6QwsN4Od7wGv8TzuO30W9rRngxaLZ0xfaLxQLuukjYiFqN6RsdX2IijSnTVIZuQyoS9
[riscv64] MI2a: maybe install (a providing target): libcairo 1:1.18.4-alt1:sisyphus_riscv64+75640.100.1.1 at 1741606770
[riscv64] MI2a: target SELECTED: libcairo 1:1.18.4-alt1:sisyphus_riscv64+75640.100.1.1 at 1741606770
[riscv64] MI2a: requesting to install libcairo (unspec'd ver; inspect with Debug::pkgMark-shallow)
[riscv64] MI2a: marked for install (shallow): libcairo
[riscv64] MI2a: satisfying Depends: libX11.so.6()(64bit) >= set:ojiyqPZBmmfzgwzMZglwYl9tc2Z8kKi3aiMtS8qA172JMuQxBIf0kdv8fXcVXy4ZozMDGOji44SaCLk0hy4PXEKxSp4DA30
[riscv64] MI2a: maybe install (a providing target): libX11 3:1.8.13-alt1:sisyphus_riscv64+110010.100.1.1 at 1770694923
[riscv64] MI2a: target SELECTED: libX11 3:1.8.13-alt1:sisyphus_riscv64+110010.100.1.1 at 1770694923
[riscv64] MI2a: requesting to install libX11 (unspec'd ver; inspect with Debug::pkgMark-shallow)
[riscv64] MI2a: marked for install (shallow): libX11
[riscv64] MI2a: satisfying Depends: libxcb.so.1()(64bit) >= set:ni0Q79T9m8c8LtIHEZvE2to7CMOpYYJtPQlu1To9g36rmZ7fk1
[riscv64] MI2a: maybe install (a providing target): libxcb 1.17.0-alt1:sisyphus_riscv64+47651.200.1.1 at 1713376021
[riscv64] MI2a: target SELECTED: libxcb 1.17.0-alt1:sisyphus_riscv64+47651.200.1.1 at 1713376021
[riscv64] MI2a: requesting to install libxcb (unspec'd ver; inspect with Debug::pkgMark-shallow)
[riscv64] MI2a: marked for install (shallow): libxcb
[riscv64] MI2a: satisfying Depends: libXau.so.6()(64bit) >= set:ge34k81
[riscv64] MI2a: maybe install (a providing target): libXau 1.0.11-alt1:sisyphus_riscv64+26806.100.1.1 at 1670595777
[riscv64] MI2a: target SELECTED: libXau 1.0.11-alt1:sisyphus_riscv64+26806.100.1.1 at 1670595777
[riscv64] MI2a: requesting to install libXau (unspec'd ver; inspect with Debug::pkgMark-shallow)
[riscv64] MI2a: marked for install (shallow): libXau
[riscv64] MI2a: satisfying Depends: libXdmcp.so.6()(64bit) >= set:jiOzo
[riscv64] MI2a: maybe install (a providing target): libXdmcp 1.1.5-alt1:sisyphus_riscv64+46670.1000.1.1 at 1711473415
[riscv64] MI2a: target SELECTED: libXdmcp 1.1.5-alt1:sisyphus_riscv64+46670.1000.1.1 at 1711473415
[riscv64] MI2a: requesting to install libXdmcp (unspec'd ver; inspect with Debug::pkgMark-shallow)
[riscv64] MI2a: marked for install (shallow): libXdmcp
[riscv64] MI2a: satisfying Depends: libX11-locales = 3:1.8.13-alt1:sisyphus_riscv64+110010.100.1.1
[riscv64] MI2a: maybe install (a direct target): libX11-locales 3:1.8.13-alt1:sisyphus_riscv64+110010.100.1.1 at 1770694923
[riscv64] MI2a: target SELECTED: libX11-locales 3:1.8.13-alt1:sisyphus_riscv64+110010.100.1.1 at 1770694923
[riscv64] MI2a: requesting to install libX11-locales (unspec'd ver; inspect with Debug::pkgMark-shallow)
[riscv64] MI2a: marked for install (shallow): libX11-locales
[riscv64] MI2a: satisfying Depends: libXext.so.6()(64bit) >= set:liWLFjrE5ZFnp8BR49YNgd
[riscv64] MI2a: maybe install (a providing target): libXext 1.3.6-alt1:sisyphus_riscv64+46670.1100.1.1 at 1711473737
[riscv64] MI2a: target SELECTED: libXext 1.3.6-alt1:sisyphus_riscv64+46670.1100.1.1 at 1711473737
[riscv64] MI2a: requesting to install libXext (unspec'd ver; inspect with Debug::pkgMark-shallow)
[riscv64] MI2a: marked for install (shallow): libXext
[riscv64] MI2a: satisfying Depends: libXrender.so.1()(64bit) >= set:jeLBBL6Tk45rZLH1cHhNtsTHjVd1FcPaZxKsGXVHSYT5CZDZf5FhpZKAda0
[riscv64] MI2a: maybe install (a providing target): libXrender 0.9.12-alt1:sisyphus_riscv64+71951.100.1.1 at 1738665677
[riscv64] MI2a: target SELECTED: libXrender 0.9.12-alt1:sisyphus_riscv64+71951.100.1.1 at 1738665677
[riscv64] MI2a: requesting to install libXrender (unspec'd ver; inspect with Debug::pkgMark-shallow)
[riscv64] MI2a: marked for install (shallow): libXrender
[riscv64] MI2a: satisfying Depends: libpixman-1.so.0()(64bit) >= set:lf5ZwVcdOaeX8umXJ79HaB3YzsrHCJDfOJGHnnAQbNpbqjYwfa3veu4vGMcCZkV5LigXOOqd1gBECaxIxFZiNURf5LMuSnyxSabeKKEZosAGBKKT3SyZBY7IWI0
[riscv64] MI2a: maybe install (a providing target): libpixman 3:0.46.4-alt0.port:sisyphus_riscv64+90345.100.1.1 at 1753351026
[riscv64] MI2a: target SELECTED: libpixman 3:0.46.4-alt0.port:sisyphus_riscv64+90345.100.1.1 at 1753351026
[riscv64] MI2a: requesting to install libpixman (unspec'd ver; inspect with Debug::pkgMark-shallow)
[riscv64] MI2a: marked for install (shallow): libpixman
[riscv64] MI2a: satisfying Depends: liblz4.so.1()(64bit) >= set:kiCcQyocph1
[riscv64] MI2a: maybe install (a providing target): liblz4 1:1.9.4-alt1:sisyphus_riscv64+25607.100.1.1 at 1667437030
[riscv64] MI2a: target SELECTED: liblz4 1:1.9.4-alt1:sisyphus_riscv64+25607.100.1.1 at 1667437030
[riscv64] MI2a: requesting to install liblz4 (unspec'd ver; inspect with Debug::pkgMark-shallow)
[riscv64] MI2a: marked for install (shallow): liblz4
[riscv64] MI2a: satisfying Depends: libopenjp2.so.7()(64bit) >= set:mhSnPptZwMZco36YsC41N35a3GRihFon5UWobZENjHZgBDfQ5LkVQWZm21Ftu1ew2NUNvzOpbqDgWRhZ4p
[riscv64] MI2a: maybe install (a providing target): libopenjpeg2.0 2.5.4-alt1:sisyphus_riscv64+95752.200.1.1 at 1758476330
[riscv64] MI2a: target SELECTED: libopenjpeg2.0 2.5.4-alt1:sisyphus_riscv64+95752.200.1.1 at 1758476330
[riscv64] MI2a: requesting to install libopenjpeg2.0 (unspec'd ver; inspect with Debug::pkgMark-shallow)
[riscv64] MI2a: marked for install (shallow): libopenjpeg2.0
[riscv64] MI2a: marked for install (shallow): libblas-devel
[riscv64] MI2a: satisfying Depends: libblas3gf = 3.9.2-alt4:sisyphus_riscv64+53342.100.1.1
[riscv64] MI2a: maybe install (a direct target): libblas3gf 3.9.2-alt4:sisyphus_riscv64+53342.100.1.1 at 1726565963
[riscv64] MI2a: target SELECTED: libblas3gf 3.9.2-alt4:sisyphus_riscv64+53342.100.1.1 at 1726565963
[riscv64] MI2a: requesting to install libblas3gf (unspec'd ver; inspect with Debug::pkgMark-shallow)
[riscv64] MI2a: marked for install (shallow): libblas3gf
[riscv64] MI2a: marked for install (shallow): liblapack-devel
[riscv64] MI2a: satisfying Depends: gcc-fortran (NULL)
[riscv64] MI2a: maybe install (a direct target): gcc-fortran 14-alt1:sisyphus_riscv64+56300.300.2.1 at 1732276643
[riscv64] MI2a: target SELECTED: gcc-fortran 14-alt1:sisyphus_riscv64+56300.300.2.1 at 1732276643
[riscv64] MI2a: requesting to install gcc-fortran (unspec'd ver; inspect with Debug::pkgMark-shallow)
[riscv64] MI2a: marked for install (shallow): gcc-fortran
[riscv64] MI2a: satisfying Depends: gcc14-fortran (NULL)
[riscv64] MI2a: maybe install (a direct target): gcc14-fortran 14.3.1-alt0.port.2:sisyphus_riscv64+98534.200.1.1 at 1761243914
[riscv64] MI2a: target SELECTED: gcc14-fortran 14.3.1-alt0.port.2:sisyphus_riscv64+98534.200.1.1 at 1761243914
[riscv64] MI2a: requesting to install gcc14-fortran (unspec'd ver; inspect with Debug::pkgMark-shallow)
[riscv64] MI2a: marked for install (shallow): gcc14-fortran
[riscv64] MI2a: satisfying Depends: libgfortran14-devel = 14.3.1-alt0.port.2:sisyphus_riscv64+98534.200.1.1
[riscv64] MI2a: maybe install (a direct target): libgfortran14-devel 14.3.1-alt0.port.2:sisyphus_riscv64+98534.200.1.1 at 1761243914
[riscv64] MI2a: target SELECTED: libgfortran14-devel 14.3.1-alt0.port.2:sisyphus_riscv64+98534.200.1.1 at 1761243914
[riscv64] MI2a: requesting to install libgfortran14-devel (unspec'd ver; inspect with Debug::pkgMark-shallow)
[riscv64] MI2a: marked for install (shallow): libgfortran14-devel
[riscv64] MI2a: satisfying PreDepends: gcc-fortran-common >= 1.4.7
[riscv64] MI2a: maybe install (a direct target): gcc-fortran-common 1.4.28-alt1:sisyphus_riscv64+49202.100.1.1 at 1716505224
[riscv64] MI2a: target SELECTED: gcc-fortran-common 1.4.28-alt1:sisyphus_riscv64+49202.100.1.1 at 1716505224
[riscv64] MI2a: requesting to install gcc-fortran-common (unspec'd ver; inspect with Debug::pkgMark-shallow)
[riscv64] MI2a: marked for install (shallow): gcc-fortran-common
[riscv64] MI2a: satisfying Depends: libopenblas-devel (NULL)
[riscv64] MI2a: maybe install (a direct target): libopenblas-devel 0.3.33-alt1:sisyphus_riscv64+120425.100.1.1 at 1778201187
[riscv64] MI2a: target SELECTED: libopenblas-devel 0.3.33-alt1:sisyphus_riscv64+120425.100.1.1 at 1778201187
[riscv64] MI2a: requesting to install libopenblas-devel (unspec'd ver; inspect with Debug::pkgMark-shallow)
[riscv64] MI2a: marked for install (shallow): libopenblas-devel
[riscv64] MI2a: satisfying Depends: liblapacke-devel = 1:3.12.1-alt1:sisyphus_riscv64+118983.200.1.1
[riscv64] MI2a: maybe install (a direct target): liblapacke-devel 1:3.12.1-alt1:sisyphus_riscv64+118983.200.1.1 at 1776316214
[riscv64] MI2a: target SELECTED: liblapacke-devel 1:3.12.1-alt1:sisyphus_riscv64+118983.200.1.1 at 1776316214
[riscv64] MI2a: requesting to install liblapacke-devel (unspec'd ver; inspect with Debug::pkgMark-shallow)
[riscv64] MI2a: marked for install (shallow): liblapacke-devel
[riscv64] MI2a: satisfying Depends: liblapacke = 1:3.12.1-alt1:sisyphus_riscv64+118983.200.1.1
[riscv64] MI2a: maybe install (a direct target): liblapacke 1:3.12.1-alt1:sisyphus_riscv64+118983.200.1.1 at 1776316214
[riscv64] MI2a: target SELECTED: liblapacke 1:3.12.1-alt1:sisyphus_riscv64+118983.200.1.1 at 1776316214
[riscv64] MI2a: requesting to install liblapacke (unspec'd ver; inspect with Debug::pkgMark-shallow)
[riscv64] MI2a: marked for install (shallow): liblapacke
[riscv64] MI2a: satisfying Depends: liblapack = 1:3.12.1-alt1:sisyphus_riscv64+118983.200.1.1
[riscv64] MI2a: maybe install (a direct target): liblapack 1:3.12.1-alt1:sisyphus_riscv64+118983.200.1.1 at 1776316214
[riscv64] MI2a: target SELECTED: liblapack 1:3.12.1-alt1:sisyphus_riscv64+118983.200.1.1 at 1776316214
[riscv64] MI2a: requesting to install liblapack (unspec'd ver; inspect with Debug::pkgMark-shallow)
[riscv64] MI2a: marked for install (shallow): liblapack
[riscv64] MI2a: satisfying Depends: libblas = 1:3.12.1-alt1:sisyphus_riscv64+118983.200.1.1
[riscv64] MI2a: maybe install (a direct target): libblas 1:3.12.1-alt1:sisyphus_riscv64+118983.200.1.1 at 1776316214
[riscv64] MI2a: target SELECTED: libblas 1:3.12.1-alt1:sisyphus_riscv64+118983.200.1.1 at 1776316214
[riscv64] MI2a: requesting to install libblas (unspec'd ver; inspect with Debug::pkgMark-shallow)
[riscv64] MI2a: marked for install (shallow): libblas
[riscv64] MI2a: marked for install (shallow): libkea-devel
[riscv64] MI2a: satisfying Depends: boost-asio-devel (NULL)
[riscv64] MI2a: maybe install (a direct target): boost-asio-devel 1:1.86.0-alt3:sisyphus_riscv64+96790.120500.15.1 at 1760672167
[riscv64] MI2a: target SELECTED: boost-asio-devel 1:1.86.0-alt3:sisyphus_riscv64+96790.120500.15.1 at 1760672167
[riscv64] MI2a: requesting to install boost-asio-devel (unspec'd ver; inspect with Debug::pkgMark-shallow)
[riscv64] MI2a: marked for install (shallow): boost-asio-devel
[riscv64] MI2a: satisfying Depends: boost-coroutine-devel = 1:1.86.0-alt3:sisyphus_riscv64+96790.120500.15.1
[riscv64] MI2a: maybe install (a direct target): boost-coroutine-devel 1:1.86.0-alt3:sisyphus_riscv64+96790.120500.15.1 at 1760672167
[riscv64] MI2a: target SELECTED: boost-coroutine-devel 1:1.86.0-alt3:sisyphus_riscv64+96790.120500.15.1 at 1760672167
[riscv64] MI2a: requesting to install boost-coroutine-devel (unspec'd ver; inspect with Debug::pkgMark-shallow)
[riscv64] MI2a: marked for install (shallow): boost-coroutine-devel
[riscv64] MI2a: satisfying Depends: boost-context-devel = 1:1.86.0-alt3:sisyphus_riscv64+96790.120500.15.1
[riscv64] MI2a: maybe install (a direct target): boost-context-devel 1:1.86.0-alt3:sisyphus_riscv64+96790.120500.15.1 at 1760672167
[riscv64] MI2a: target SELECTED: boost-context-devel 1:1.86.0-alt3:sisyphus_riscv64+96790.120500.15.1 at 1760672167
[riscv64] MI2a: requesting to install boost-context-devel (unspec'd ver; inspect with Debug::pkgMark-shallow)
[riscv64] MI2a: marked for install (shallow): boost-context-devel
[riscv64] MI2a: satisfying PreDepends: boost-devel = 1:1.86.0-alt3:sisyphus_riscv64+96790.120500.15.1
[riscv64] MI2a: maybe install (a direct target): boost-devel 1:1.86.0-alt3:sisyphus_riscv64+96790.120500.15.1 at 1760672167
[riscv64] MI2a: target SELECTED: boost-devel 1:1.86.0-alt3:sisyphus_riscv64+96790.120500.15.1 at 1760672167
[riscv64] MI2a: requesting to install boost-devel (unspec'd ver; inspect with Debug::pkgMark-shallow)
[riscv64] MI2a: marked for install (shallow): boost-devel
[riscv64] MI2a: satisfying PreDepends: boost-devel-headers = 1:1.86.0-alt3:sisyphus_riscv64+96790.120500.15.1
[riscv64] MI2a: maybe install (a direct target): boost-devel-headers 1:1.86.0-alt3:sisyphus_riscv64+96790.120500.15.1 at 1760672167
[riscv64] MI2a: target SELECTED: boost-devel-headers 1:1.86.0-alt3:sisyphus_riscv64+96790.120500.15.1 at 1760672167
[riscv64] MI2a: requesting to install boost-devel-headers (unspec'd ver; inspect with Debug::pkgMark-shallow)
[riscv64] MI2a: marked for install (shallow): boost-devel-headers
[riscv64] MI2a: satisfying Depends: libboost_atomic1.86.0 = 1:1.86.0-alt3:sisyphus_riscv64+96790.120500.15.1
[riscv64] MI2a: maybe install (a direct target): libboost_atomic1.86.0 1:1.86.0-alt3:sisyphus_riscv64+96790.120500.15.1 at 1760672167
[riscv64] MI2a: target SELECTED: libboost_atomic1.86.0 1:1.86.0-alt3:sisyphus_riscv64+96790.120500.15.1 at 1760672167
[riscv64] MI2a: requesting to install libboost_atomic1.86.0 (unspec'd ver; inspect with Debug::pkgMark-shallow)
[riscv64] MI2a: marked for install (shallow): libboost_atomic1.86.0
[riscv64] MI2a: satisfying Depends: libboost_system1.86.0 = 1:1.86.0-alt3:sisyphus_riscv64+96790.120500.15.1
[riscv64] MI2a: maybe install (a direct target): libboost_system1.86.0 1:1.86.0-alt3:sisyphus_riscv64+96790.120500.15.1 at 1760672167
[riscv64] MI2a: target SELECTED: libboost_system1.86.0 1:1.86.0-alt3:sisyphus_riscv64+96790.120500.15.1 at 1760672167
[riscv64] MI2a: requesting to install libboost_system1.86.0 (unspec'd ver; inspect with Debug::pkgMark-shallow)
[riscv64] MI2a: marked for install (shallow): libboost_system1.86.0
[riscv64] MI2a: satisfying Depends: libboost_charconv1.86.0 = 1:1.86.0-alt3:sisyphus_riscv64+96790.120500.15.1
[riscv64] MI2a: maybe install (a direct target): libboost_charconv1.86.0 1:1.86.0-alt3:sisyphus_riscv64+96790.120500.15.1 at 1760672167
[riscv64] MI2a: target SELECTED: libboost_charconv1.86.0 1:1.86.0-alt3:sisyphus_riscv64+96790.120500.15.1 at 1760672167
[riscv64] MI2a: requesting to install libboost_charconv1.86.0 (unspec'd ver; inspect with Debug::pkgMark-shallow)
[riscv64] MI2a: marked for install (shallow): libboost_charconv1.86.0
[riscv64] MI2a: satisfying Depends: libboost_container1.86.0 = 1:1.86.0-alt3:sisyphus_riscv64+96790.120500.15.1
[riscv64] MI2a: maybe install (a direct target): libboost_container1.86.0 1:1.86.0-alt3:sisyphus_riscv64+96790.120500.15.1 at 1760672167
[riscv64] MI2a: target SELECTED: libboost_container1.86.0 1:1.86.0-alt3:sisyphus_riscv64+96790.120500.15.1 at 1760672167
[riscv64] MI2a: requesting to install libboost_container1.86.0 (unspec'd ver; inspect with Debug::pkgMark-shallow)
[riscv64] MI2a: marked for install (shallow): libboost_container1.86.0
[riscv64] MI2a: satisfying Depends: libboost_contract1.86.0 = 1:1.86.0-alt3:sisyphus_riscv64+96790.120500.15.1
[riscv64] MI2a: maybe install (a direct target): libboost_contract1.86.0 1:1.86.0-alt3:sisyphus_riscv64+96790.120500.15.1 at 1760672167
[riscv64] MI2a: target SELECTED: libboost_contract1.86.0 1:1.86.0-alt3:sisyphus_riscv64+96790.120500.15.1 at 1760672167
[riscv64] MI2a: requesting to install libboost_contract1.86.0 (unspec'd ver; inspect with Debug::pkgMark-shallow)
[riscv64] MI2a: marked for install (shallow): libboost_contract1.86.0
[riscv64] MI2a: satisfying Depends: libboost_date_time1.86.0 = 1:1.86.0-alt3:sisyphus_riscv64+96790.120500.15.1
[riscv64] MI2a: maybe install (a direct target): libboost_date_time1.86.0 1:1.86.0-alt3:sisyphus_riscv64+96790.120500.15.1 at 1760672167
[riscv64] MI2a: target SELECTED: libboost_date_time1.86.0 1:1.86.0-alt3:sisyphus_riscv64+96790.120500.15.1 at 1760672167
[riscv64] MI2a: requesting to install libboost_date_time1.86.0 (unspec'd ver; inspect with Debug::pkgMark-shallow)
[riscv64] MI2a: marked for install (shallow): libboost_date_time1.86.0
[riscv64] MI2a: satisfying Depends: libboost_graph1.86.0 = 1:1.86.0-alt3:sisyphus_riscv64+96790.120500.15.1
[riscv64] MI2a: maybe install (a direct target): libboost_graph1.86.0 1:1.86.0-alt3:sisyphus_riscv64+96790.120500.15.1 at 1760672167
[riscv64] MI2a: target SELECTED: libboost_graph1.86.0 1:1.86.0-alt3:sisyphus_riscv64+96790.120500.15.1 at 1760672167
[riscv64] MI2a: requesting to install libboost_graph1.86.0 (unspec'd ver; inspect with Debug::pkgMark-shallow)
[riscv64] MI2a: marked for install (shallow): libboost_graph1.86.0
[riscv64] MI2a: satisfying Depends: libboost_regex1.86.0 = 1:1.86.0-alt3:sisyphus_riscv64+96790.120500.15.1
[riscv64] MI2a: maybe install (a direct target): libboost_regex1.86.0 1:1.86.0-alt3:sisyphus_riscv64+96790.120500.15.1 at 1760672167
[riscv64] MI2a: target SELECTED: libboost_regex1.86.0 1:1.86.0-alt3:sisyphus_riscv64+96790.120500.15.1 at 1760672167
[riscv64] MI2a: requesting to install libboost_regex1.86.0 (unspec'd ver; inspect with Debug::pkgMark-shallow)
[riscv64] MI2a: marked for install (shallow): libboost_regex1.86.0
[riscv64] MI2a: satisfying Depends: libboost_json1.86.0 = 1:1.86.0-alt3:sisyphus_riscv64+96790.120500.15.1
[riscv64] MI2a: maybe install (a direct target): libboost_json1.86.0 1:1.86.0-alt3:sisyphus_riscv64+96790.120500.15.1 at 1760672167
[riscv64] MI2a: target SELECTED: libboost_json1.86.0 1:1.86.0-alt3:sisyphus_riscv64+96790.120500.15.1 at 1760672167
[riscv64] MI2a: requesting to install libboost_json1.86.0 (unspec'd ver; inspect with Debug::pkgMark-shallow)
[riscv64] MI2a: marked for install (shallow): libboost_json1.86.0
[riscv64] MI2a: satisfying Depends: libboost_iostreams1.86.0 = 1:1.86.0-alt3:sisyphus_riscv64+96790.120500.15.1
[riscv64] MI2a: maybe install (a direct target): libboost_iostreams1.86.0 1:1.86.0-alt3:sisyphus_riscv64+96790.120500.15.1 at 1760672167
[riscv64] MI2a: target SELECTED: libboost_iostreams1.86.0 1:1.86.0-alt3:sisyphus_riscv64+96790.120500.15.1 at 1760672167
[riscv64] MI2a: requesting to install libboost_iostreams1.86.0 (unspec'd ver; inspect with Debug::pkgMark-shallow)
[riscv64] MI2a: marked for install (shallow): libboost_iostreams1.86.0
[riscv64] MI2a: satisfying Depends: libboost_process1.86.0 = 1:1.86.0-alt3:sisyphus_riscv64+96790.120500.15.1
[riscv64] MI2a: maybe install (a direct target): libboost_process1.86.0 1:1.86.0-alt3:sisyphus_riscv64+96790.120500.15.1 at 1760672167
[riscv64] MI2a: target SELECTED: libboost_process1.86.0 1:1.86.0-alt3:sisyphus_riscv64+96790.120500.15.1 at 1760672167
[riscv64] MI2a: requesting to install libboost_process1.86.0 (unspec'd ver; inspect with Debug::pkgMark-shallow)
[riscv64] MI2a: marked for install (shallow): libboost_process1.86.0
[riscv64] MI2a: satisfying Depends: libboost_filesystem1.86.0 = 1:1.86.0-alt3:sisyphus_riscv64+96790.120500.15.1
[riscv64] MI2a: maybe install (a direct target): libboost_filesystem1.86.0 1:1.86.0-alt3:sisyphus_riscv64+96790.120500.15.1 at 1760672167
[riscv64] MI2a: target SELECTED: libboost_filesystem1.86.0 1:1.86.0-alt3:sisyphus_riscv64+96790.120500.15.1 at 1760672167
[riscv64] MI2a: requesting to install libboost_filesystem1.86.0 (unspec'd ver; inspect with Debug::pkgMark-shallow)
[riscv64] MI2a: marked for install (shallow): libboost_filesystem1.86.0
[riscv64] MI2a: satisfying Depends: libboost_random1.86.0 = 1:1.86.0-alt3:sisyphus_riscv64+96790.120500.15.1
[riscv64] MI2a: maybe install (a direct target): libboost_random1.86.0 1:1.86.0-alt3:sisyphus_riscv64+96790.120500.15.1 at 1760672167
[riscv64] MI2a: target SELECTED: libboost_random1.86.0 1:1.86.0-alt3:sisyphus_riscv64+96790.120500.15.1 at 1760672167
[riscv64] MI2a: requesting to install libboost_random1.86.0 (unspec'd ver; inspect with Debug::pkgMark-shallow)
[riscv64] MI2a: marked for install (shallow): libboost_random1.86.0
[riscv64] MI2a: satisfying Depends: libboost_serialization1.86.0 = 1:1.86.0-alt3:sisyphus_riscv64+96790.120500.15.1
[riscv64] MI2a: maybe install (a direct target): libboost_serialization1.86.0 1:1.86.0-alt3:sisyphus_riscv64+96790.120500.15.1 at 1760672167
[riscv64] MI2a: target SELECTED: libboost_serialization1.86.0 1:1.86.0-alt3:sisyphus_riscv64+96790.120500.15.1 at 1760672167
[riscv64] MI2a: requesting to install libboost_serialization1.86.0 (unspec'd ver; inspect with Debug::pkgMark-shallow)
[riscv64] MI2a: marked for install (shallow): libboost_serialization1.86.0
[riscv64] MI2a: satisfying Depends: libboost_test1.86.0 = 1:1.86.0-alt3:sisyphus_riscv64+96790.120500.15.1
[riscv64] MI2a: maybe install (a direct target): libboost_test1.86.0 1:1.86.0-alt3:sisyphus_riscv64+96790.120500.15.1 at 1760672167
[riscv64] MI2a: target SELECTED: libboost_test1.86.0 1:1.86.0-alt3:sisyphus_riscv64+96790.120500.15.1 at 1760672167
[riscv64] MI2a: requesting to install libboost_test1.86.0 (unspec'd ver; inspect with Debug::pkgMark-shallow)
[riscv64] MI2a: marked for install (shallow): libboost_test1.86.0
[riscv64] MI2a: satisfying Depends: libboost_timer1.86.0 = 1:1.86.0-alt3:sisyphus_riscv64+96790.120500.15.1
[riscv64] MI2a: maybe install (a direct target): libboost_timer1.86.0 1:1.86.0-alt3:sisyphus_riscv64+96790.120500.15.1 at 1760672167
[riscv64] MI2a: target SELECTED: libboost_timer1.86.0 1:1.86.0-alt3:sisyphus_riscv64+96790.120500.15.1 at 1760672167
[riscv64] MI2a: requesting to install libboost_timer1.86.0 (unspec'd ver; inspect with Debug::pkgMark-shallow)
[riscv64] MI2a: marked for install (shallow): libboost_timer1.86.0
[riscv64] MI2a: satisfying Depends: libboost_chrono1.86.0 = 1:1.86.0-alt3:sisyphus_riscv64+96790.120500.15.1
[riscv64] MI2a: maybe install (a direct target): libboost_chrono1.86.0 1:1.86.0-alt3:sisyphus_riscv64+96790.120500.15.1 at 1760672167
[riscv64] MI2a: target SELECTED: libboost_chrono1.86.0 1:1.86.0-alt3:sisyphus_riscv64+96790.120500.15.1 at 1760672167
[riscv64] MI2a: requesting to install libboost_chrono1.86.0 (unspec'd ver; inspect with Debug::pkgMark-shallow)
[riscv64] MI2a: marked for install (shallow): libboost_chrono1.86.0
[riscv64] MI2a: satisfying Depends: libboost_url1.86.0 = 1:1.86.0-alt3:sisyphus_riscv64+96790.120500.15.1
[riscv64] MI2a: maybe install (a direct target): libboost_url1.86.0 1:1.86.0-alt3:sisyphus_riscv64+96790.120500.15.1 at 1760672167
[riscv64] MI2a: target SELECTED: libboost_url1.86.0 1:1.86.0-alt3:sisyphus_riscv64+96790.120500.15.1 at 1760672167
[riscv64] MI2a: requesting to install libboost_url1.86.0 (unspec'd ver; inspect with Debug::pkgMark-shallow)
[riscv64] MI2a: marked for install (shallow): libboost_url1.86.0
[riscv64] MI2a: satisfying Depends: libboost_nowide1.86.0 = 1:1.86.0-alt3:sisyphus_riscv64+96790.120500.15.1
[riscv64] MI2a: maybe install (a direct target): libboost_nowide1.86.0 1:1.86.0-alt3:sisyphus_riscv64+96790.120500.15.1 at 1760672167
[riscv64] MI2a: target SELECTED: libboost_nowide1.86.0 1:1.86.0-alt3:sisyphus_riscv64+96790.120500.15.1 at 1760672167
[riscv64] MI2a: requesting to install libboost_nowide1.86.0 (unspec'd ver; inspect with Debug::pkgMark-shallow)
[riscv64] MI2a: marked for install (shallow): libboost_nowide1.86.0
[riscv64] MI2a: satisfying Depends: libboost_stacktrace1.86.0 = 1:1.86.0-alt3:sisyphus_riscv64+96790.120500.15.1
[riscv64] MI2a: maybe install (a direct target): libboost_stacktrace1.86.0 1:1.86.0-alt3:sisyphus_riscv64+96790.120500.15.1 at 1760672167
[riscv64] MI2a: target SELECTED: libboost_stacktrace1.86.0 1:1.86.0-alt3:sisyphus_riscv64+96790.120500.15.1 at 1760672167
[riscv64] MI2a: requesting to install libboost_stacktrace1.86.0 (unspec'd ver; inspect with Debug::pkgMark-shallow)
[riscv64] MI2a: marked for install (shallow): libboost_stacktrace1.86.0
[riscv64] MI2a: satisfying Depends: libboost_fiber1.86.0 = 1:1.86.0-alt3:sisyphus_riscv64+96790.120500.15.1
[riscv64] MI2a: maybe install (a direct target): libboost_fiber1.86.0 1:1.86.0-alt3:sisyphus_riscv64+96790.120500.15.1 at 1760672167
[riscv64] MI2a: target SELECTED: libboost_fiber1.86.0 1:1.86.0-alt3:sisyphus_riscv64+96790.120500.15.1 at 1760672167
[riscv64] MI2a: requesting to install libboost_fiber1.86.0 (unspec'd ver; inspect with Debug::pkgMark-shallow)
[riscv64] MI2a: marked for install (shallow): libboost_fiber1.86.0
[riscv64] MI2a: satisfying Depends: libboost_context1.86.0 = 1:1.86.0-alt3:sisyphus_riscv64+96790.120500.15.1
[riscv64] MI2a: maybe install (a direct target): libboost_context1.86.0 1:1.86.0-alt3:sisyphus_riscv64+96790.120500.15.1 at 1760672167
[riscv64] MI2a: target SELECTED: libboost_context1.86.0 1:1.86.0-alt3:sisyphus_riscv64+96790.120500.15.1 at 1760672167
[riscv64] MI2a: requesting to install libboost_context1.86.0 (unspec'd ver; inspect with Debug::pkgMark-shallow)
[riscv64] MI2a: marked for install (shallow): libboost_context1.86.0
[riscv64] MI2a: satisfying Depends: libboost_type_erasure1.86.0 = 1:1.86.0-alt3:sisyphus_riscv64+96790.120500.15.1
[riscv64] MI2a: maybe install (a direct target): libboost_type_erasure1.86.0 1:1.86.0-alt3:sisyphus_riscv64+96790.120500.15.1 at 1760672167
[riscv64] MI2a: target SELECTED: libboost_type_erasure1.86.0 1:1.86.0-alt3:sisyphus_riscv64+96790.120500.15.1 at 1760672167
[riscv64] MI2a: requesting to install libboost_type_erasure1.86.0 (unspec'd ver; inspect with Debug::pkgMark-shallow)
[riscv64] MI2a: marked for install (shallow): libboost_type_erasure1.86.0
[riscv64] MI2a: satisfying Depends: libboost_thread1.86.0 = 1:1.86.0-alt3:sisyphus_riscv64+96790.120500.15.1
[riscv64] MI2a: maybe install (a direct target): libboost_thread1.86.0 1:1.86.0-alt3:sisyphus_riscv64+96790.120500.15.1 at 1760672167
[riscv64] MI2a: target SELECTED: libboost_thread1.86.0 1:1.86.0-alt3:sisyphus_riscv64+96790.120500.15.1 at 1760672167
[riscv64] MI2a: requesting to install libboost_thread1.86.0 (unspec'd ver; inspect with Debug::pkgMark-shallow)
[riscv64] MI2a: marked for install (shallow): libboost_thread1.86.0
[riscv64] MI2a: satisfying Depends: libboost_coroutine1.86.0 = 1:1.86.0-alt3:sisyphus_riscv64+96790.120500.15.1
[riscv64] MI2a: maybe install (a direct target): libboost_coroutine1.86.0 1:1.86.0-alt3:sisyphus_riscv64+96790.120500.15.1 at 1760672167
[riscv64] MI2a: target SELECTED: libboost_coroutine1.86.0 1:1.86.0-alt3:sisyphus_riscv64+96790.120500.15.1 at 1760672167
[riscv64] MI2a: requesting to install libboost_coroutine1.86.0 (unspec'd ver; inspect with Debug::pkgMark-shallow)
[riscv64] MI2a: marked for install (shallow): libboost_coroutine1.86.0
[riscv64] MI2a: satisfying Depends: liblog4cplus-devel (NULL)
[riscv64] MI2a: maybe install (a direct target): liblog4cplus-devel 2.1.2-alt2:sisyphus_riscv64+96790.10000.3.1 at 1760198452
[riscv64] MI2a: target SELECTED: liblog4cplus-devel 2.1.2-alt2:sisyphus_riscv64+96790.10000.3.1 at 1760198452
[riscv64] MI2a: requesting to install liblog4cplus-devel (unspec'd ver; inspect with Debug::pkgMark-shallow)
[riscv64] MI2a: marked for install (shallow): liblog4cplus-devel
[riscv64] MI2a: satisfying Depends: liblog4cplus9 = 2.1.2-alt2:sisyphus_riscv64+96790.10000.3.1
[riscv64] MI2a: maybe install (a direct target): liblog4cplus9 2.1.2-alt2:sisyphus_riscv64+96790.10000.3.1 at 1760198452
[riscv64] MI2a: target SELECTED: liblog4cplus9 2.1.2-alt2:sisyphus_riscv64+96790.10000.3.1 at 1760198452
[riscv64] MI2a: requesting to install liblog4cplus9 (unspec'd ver; inspect with Debug::pkgMark-shallow)
[riscv64] MI2a: marked for install (shallow): liblog4cplus9
[riscv64] MI2a: satisfying Depends: pkgconfig(krb5-gssapi) (NULL)
[riscv64] MI2a: maybe install (a providing target): libkrb5-devel 1.22.2-alt1:sisyphus_riscv64+109182.100.1.1 at 1770257536
[riscv64] MI2a: target SELECTED: libkrb5-devel 1.22.2-alt1:sisyphus_riscv64+109182.100.1.1 at 1770257536
[riscv64] MI2a: requesting to install libkrb5-devel (unspec'd ver; inspect with Debug::pkgMark-shallow)
[riscv64] MI2a: marked for install (shallow): libkrb5-devel
[riscv64] MI2a: satisfying Depends: libcom_err-devel (NULL)
[riscv64] MI2a: maybe install (a direct target): libcom_err-devel 1.47.1.0.10.ad56-alt2:sisyphus_riscv64+65703.100.1.1 at 1732769486
[riscv64] MI2a: target SELECTED: libcom_err-devel 1.47.1.0.10.ad56-alt2:sisyphus_riscv64+65703.100.1.1 at 1732769486
[riscv64] MI2a: requesting to install libcom_err-devel (unspec'd ver; inspect with Debug::pkgMark-shallow)
[riscv64] MI2a: marked for install (shallow): libcom_err-devel
[riscv64] MI2a: satisfying Depends: libverto-devel (NULL)
[riscv64] MI2a: maybe install (a direct target): libverto-devel 0.3.2-alt1_1:sisyphus_riscv64+33133.1200.2.1 at 1684932150
[riscv64] MI2a: target SELECTED: libverto-devel 0.3.2-alt1_1:sisyphus_riscv64+33133.1200.2.1 at 1684932150
[riscv64] MI2a: requesting to install libverto-devel (unspec'd ver; inspect with Debug::pkgMark-shallow)
[riscv64] MI2a: marked for install (shallow): libverto-devel
[riscv64] MI2a: satisfying Depends: libkrb5-ldap = 1.22.2-alt1:sisyphus_riscv64+109182.100.1.1
[riscv64] MI2a: maybe install (a direct target): libkrb5-ldap 1.22.2-alt1:sisyphus_riscv64+109182.100.1.1 at 1770257536
[riscv64] MI2a: target SELECTED: libkrb5-ldap 1.22.2-alt1:sisyphus_riscv64+109182.100.1.1 at 1770257536
[riscv64] MI2a: requesting to install libkrb5-ldap (unspec'd ver; inspect with Debug::pkgMark-shallow)
[riscv64] MI2a: marked for install (shallow): libkrb5-ldap
[riscv64] MI2a: satisfying Depends: pkgconfig(openssl) (NULL)
[riscv64] MI2a: maybe install (a providing target): libssl-devel 3.5.4-alt1:sisyphus_riscv64+99925.200.1.1 at 1762591620
[riscv64] MI2a: target SELECTED: libssl-devel 3.5.4-alt1:sisyphus_riscv64+99925.200.1.1 at 1762591620
[riscv64] MI2a: requesting to install libssl-devel (unspec'd ver; inspect with Debug::pkgMark-shallow)
[riscv64] MI2a: marked for install (shallow): libssl-devel
[riscv64] MI2a: satisfying Depends: kea-mysql = 3.0.3-alt1:sisyphus_riscv64+117146.100.1.1
[riscv64] MI2a: maybe install (a direct target): kea-mysql 3.0.3-alt1:sisyphus_riscv64+117146.100.1.1 at 1774931300
[riscv64] MI2a: target SELECTED: kea-mysql 3.0.3-alt1:sisyphus_riscv64+117146.100.1.1 at 1774931300
[riscv64] MI2a: requesting to install kea-mysql (unspec'd ver; inspect with Debug::pkgMark-shallow)
[riscv64] MI2a: marked for install (shallow): kea-mysql
[riscv64] MI2a: satisfying Depends: kea-common = 3.0.3-alt1:sisyphus_riscv64+117146.100.1.1
[riscv64] MI2a: maybe install (a direct target): kea-common 3.0.3-alt1:sisyphus_riscv64+117146.100.1.1 at 1774931300
[riscv64] MI2a: target SELECTED: kea-common 3.0.3-alt1:sisyphus_riscv64+117146.100.1.1 at 1774931300
[riscv64] MI2a: requesting to install kea-common (unspec'd ver; inspect with Debug::pkgMark-shallow)
[riscv64] MI2a: marked for install (shallow): kea-common
[riscv64] MI2a: satisfying Depends: libkea = 3.0.3-alt1:sisyphus_riscv64+117146.100.1.1
[riscv64] MI2a: maybe install (a direct target): libkea 3.0.3-alt1:sisyphus_riscv64+117146.100.1.1 at 1774931300
[riscv64] MI2a: target SELECTED: libkea 3.0.3-alt1:sisyphus_riscv64+117146.100.1.1 at 1774931300
[riscv64] MI2a: requesting to install libkea (unspec'd ver; inspect with Debug::pkgMark-shallow)
[riscv64] MI2a: marked for install (shallow): libkea
[riscv64] MI2a: satisfying Depends: kea-pgsql = 3.0.3-alt1:sisyphus_riscv64+117146.100.1.1
[riscv64] MI2a: maybe install (a direct target): kea-pgsql 3.0.3-alt1:sisyphus_riscv64+117146.100.1.1 at 1774931300
[riscv64] MI2a: target SELECTED: kea-pgsql 3.0.3-alt1:sisyphus_riscv64+117146.100.1.1 at 1774931300
[riscv64] MI2a: requesting to install kea-pgsql (unspec'd ver; inspect with Debug::pkgMark-shallow)
[riscv64] MI2a: marked for install (shallow): kea-pgsql
[riscv64] MI2a: marked for install (shallow): ocl-icd-devel
[riscv64] MI2a: satisfying Depends: opencl-headers (NULL)
[riscv64] MI2a: maybe install (a direct target): opencl-headers 1:2025.07.22-alt1:sisyphus_riscv64+111686.100.1.1 at 1771943591
[riscv64] MI2a: target SELECTED: opencl-headers 1:2025.07.22-alt1:sisyphus_riscv64+111686.100.1.1 at 1771943591
[riscv64] MI2a: requesting to install opencl-headers (unspec'd ver; inspect with Debug::pkgMark-shallow)
[riscv64] MI2a: marked for install (shallow): opencl-headers
[riscv64] MI2a: satisfying Depends: libva-devel (NULL)
[riscv64] MI2a: maybe install (a direct target): libva-devel 2.23.0-alt1:sisyphus_riscv64+104801.100.1.1 at 1766276072
[riscv64] MI2a: target SELECTED: libva-devel 2.23.0-alt1:sisyphus_riscv64+104801.100.1.1 at 1766276072
[riscv64] MI2a: requesting to install libva-devel (unspec'd ver; inspect with Debug::pkgMark-shallow)
[riscv64] MI2a: marked for install (shallow): libva-devel
[riscv64] MI2a: satisfying Depends: libX11-devel (NULL)
[riscv64] MI2a: maybe install (a direct target): libX11-devel 3:1.8.13-alt1:sisyphus_riscv64+110010.100.1.1 at 1770694923
[riscv64] MI2a: target SELECTED: libX11-devel 3:1.8.13-alt1:sisyphus_riscv64+110010.100.1.1 at 1770694923
[riscv64] MI2a: requesting to install libX11-devel (unspec'd ver; inspect with Debug::pkgMark-shallow)
[riscv64] MI2a: marked for install (shallow): libX11-devel
[riscv64] MI2a: satisfying Depends: libxcb-devel (NULL)
[riscv64] MI2a: maybe install (a direct target): libxcb-devel 1.17.0-alt1:sisyphus_riscv64+47651.200.1.1 at 1713376021
[riscv64] MI2a: target SELECTED: libxcb-devel 1.17.0-alt1:sisyphus_riscv64+47651.200.1.1 at 1713376021
[riscv64] MI2a: requesting to install libxcb-devel (unspec'd ver; inspect with Debug::pkgMark-shallow)
[riscv64] MI2a: marked for install (shallow): libxcb-devel
[riscv64] MI2a: satisfying Depends: pkgconfig(kbproto) (NULL)
[riscv64] MI2a: maybe install (a providing target): xorg-proto-devel 2025.1-alt1:sisyphus_riscv64+107259.100.1.1 at 1768840357
[riscv64] MI2a: target SELECTED: xorg-proto-devel 2025.1-alt1:sisyphus_riscv64+107259.100.1.1 at 1768840357
[riscv64] MI2a: requesting to install xorg-proto-devel (unspec'd ver; inspect with Debug::pkgMark-shallow)
[riscv64] MI2a: marked for install (shallow): xorg-proto-devel
[riscv64] MI2a: satisfying Depends: libglvnd-devel (NULL)
[riscv64] MI2a: maybe install (a direct target): libglvnd-devel 7:1.7.0-alt1:sisyphus_riscv64+38766.100.1.1 at 1696448292
[riscv64] MI2a: target SELECTED: libglvnd-devel 7:1.7.0-alt1:sisyphus_riscv64+38766.100.1.1 at 1696448292
[riscv64] MI2a: requesting to install libglvnd-devel (unspec'd ver; inspect with Debug::pkgMark-shallow)
[riscv64] MI2a: marked for install (shallow): libglvnd-devel
[riscv64] MI2a: satisfying Depends: libOpenGL = 7:1.7.0-alt1:sisyphus_riscv64+38766.100.1.1
[riscv64] MI2a: maybe install (a direct target): libOpenGL 7:1.7.0-alt1:sisyphus_riscv64+38766.100.1.1 at 1696448292
[riscv64] MI2a: target SELECTED: libOpenGL 7:1.7.0-alt1:sisyphus_riscv64+38766.100.1.1 at 1696448292
[riscv64] MI2a: requesting to install libOpenGL (unspec'd ver; inspect with Debug::pkgMark-shallow)
[riscv64] MI2a: marked for install (shallow): libOpenGL
[riscv64] MI2a: satisfying Depends: libglvnd = 7:1.7.0-alt1:sisyphus_riscv64+38766.100.1.1
[riscv64] MI2a: maybe install (a direct target): libglvnd 7:1.7.0-alt1:sisyphus_riscv64+38766.100.1.1 at 1696448292
[riscv64] MI2a: target SELECTED: libglvnd 7:1.7.0-alt1:sisyphus_riscv64+38766.100.1.1 at 1696448292
[riscv64] MI2a: requesting to install libglvnd (unspec'd ver; inspect with Debug::pkgMark-shallow)
[riscv64] MI2a: marked for install (shallow): libglvnd
[riscv64] MI2a: satisfying Depends: libGLES = 7:1.7.0-alt1:sisyphus_riscv64+38766.100.1.1
[riscv64] MI2a: maybe install (a direct target): libGLES 7:1.7.0-alt1:sisyphus_riscv64+38766.100.1.1 at 1696448292
[riscv64] MI2a: target SELECTED: libGLES 7:1.7.0-alt1:sisyphus_riscv64+38766.100.1.1 at 1696448292
[riscv64] MI2a: requesting to install libGLES (unspec'd ver; inspect with Debug::pkgMark-shallow)
[riscv64] MI2a: marked for install (shallow): libGLES
[riscv64] MI2a: satisfying Depends: libEGL = 7:1.7.0-alt1:sisyphus_riscv64+38766.100.1.1
[riscv64] MI2a: maybe install (a direct target): libEGL 7:1.7.0-alt1:sisyphus_riscv64+38766.100.1.1 at 1696448292
[riscv64] MI2a: target SELECTED: libEGL 7:1.7.0-alt1:sisyphus_riscv64+38766.100.1.1 at 1696448292
[riscv64] MI2a: requesting to install libEGL (unspec'd ver; inspect with Debug::pkgMark-shallow)
[riscv64] MI2a: marked for install (shallow): libEGL
[riscv64] MI2a: satisfying Depends: libEGL-mesa (NULL)
[riscv64] MI2a: maybe install (a direct target): libEGL-mesa 4:26.0.5-alt1:sisyphus_riscv64+119825.200.1.1 at 1776771683
[riscv64] MI2a: target SELECTED: libEGL-mesa 4:26.0.5-alt1:sisyphus_riscv64+119825.200.1.1 at 1776771683
[riscv64] MI2a: requesting to install libEGL-mesa (unspec'd ver; inspect with Debug::pkgMark-shallow)
[riscv64] MI2a: marked for install (shallow): libEGL-mesa
[riscv64] MI2a: satisfying Depends: libdrm.so.2()(64bit) >= set:lhVSaEFLUMTcSknm66lzroxpRwQ9f28b7opl5MMU50
[riscv64] MI2a: maybe install (a providing target): libdrm 1:2.4.131-alt1:sisyphus_riscv64+119825.100.1.1 at 1776770555
[riscv64] MI2a: target SELECTED: libdrm 1:2.4.131-alt1:sisyphus_riscv64+119825.100.1.1 at 1776770555
[riscv64] MI2a: requesting to install libdrm (unspec'd ver; inspect with Debug::pkgMark-shallow)
[riscv64] MI2a: marked for install (shallow): libdrm
[riscv64] MI2a: satisfying Depends: libwayland-client.so.0()(64bit) >= set:kfD6LXuB4d7Rj9Qtw3aOPhGPIYxTqMKOGhQrocjrgS2svc5SdOU1Z5Asgt1hkZCv1
[riscv64] MI2a: maybe install (a providing target): libwayland-client 1.25.0-alt1.1:sisyphus_riscv64+115618.100.1.2 at 1774026510
[riscv64] MI2a: target SELECTED: libwayland-client 1.25.0-alt1.1:sisyphus_riscv64+115618.100.1.2 at 1774026510
[riscv64] MI2a: requesting to install libwayland-client (unspec'd ver; inspect with Debug::pkgMark-shallow)
[riscv64] MI2a: marked for install (shallow): libwayland-client
[riscv64] MI2a: satisfying Depends: libGLX-mesa = 4:26.0.5-alt1:sisyphus_riscv64+119825.200.1.1
[riscv64] MI2a: maybe install (a direct target): libGLX-mesa 4:26.0.5-alt1:sisyphus_riscv64+119825.200.1.1 at 1776771683
[riscv64] MI2a: target SELECTED: libGLX-mesa 4:26.0.5-alt1:sisyphus_riscv64+119825.200.1.1 at 1776771683
[riscv64] MI2a: requesting to install libGLX-mesa (unspec'd ver; inspect with Debug::pkgMark-shallow)
[riscv64] MI2a: marked for install (shallow): libGLX-mesa
[riscv64] MI2a: satisfying Depends: libXxf86vm.so.1()(64bit) >= set:igjixWx0
[riscv64] MI2a: maybe install (a providing target): libXxf86vm 1.1.5-alt1:sisyphus_riscv64+25114.1300.1.1 at 1666212308
[riscv64] MI2a: target SELECTED: libXxf86vm 1.1.5-alt1:sisyphus_riscv64+25114.1300.1.1 at 1666212308
[riscv64] MI2a: requesting to install libXxf86vm (unspec'd ver; inspect with Debug::pkgMark-shallow)
[riscv64] MI2a: marked for install (shallow): libXxf86vm
[riscv64] MI2a: satisfying Depends: libsensors.so.5()(64bit) >= set:if6ejny3uZ1gaOt4Zrd
[riscv64] MI2a: maybe install (a providing target): libsensors3 3.6.2-alt3:sisyphus_riscv64+91995.100.1.1 at 1754907468
[riscv64] MI2a: target SELECTED: libsensors3 3.6.2-alt3:sisyphus_riscv64+91995.100.1.1 at 1754907468
[riscv64] MI2a: requesting to install libsensors3 (unspec'd ver; inspect with Debug::pkgMark-shallow)
[riscv64] MI2a: marked for install (shallow): libsensors3
[riscv64] MI2a: satisfying Depends: libunwind.so.8()(64bit) >= set:kjVg7
[riscv64] MI2a: maybe install (a providing target): libunwind 1.7.0-alt2:sisyphus_riscv64+41388.100.1.1 at 1701185755
[riscv64] MI2a: target SELECTED: libunwind 1.7.0-alt2:sisyphus_riscv64+41388.100.1.1 at 1701185755
[riscv64] MI2a: requesting to install libunwind (unspec'd ver; inspect with Debug::pkgMark-shallow)
[riscv64] MI2a: marked for install (shallow): libunwind
[riscv64] MI2a: satisfying Depends: libxshmfence.so.1()(64bit) >= set:gddAWi5JoNuyr8
[riscv64] MI2a: maybe install (a providing target): libxshmfence 1.3.2-alt1:sisyphus_riscv64+26806.400.1.1 at 1670596415
[riscv64] MI2a: target SELECTED: libxshmfence 1.3.2-alt1:sisyphus_riscv64+26806.400.1.1 at 1670596415
[riscv64] MI2a: requesting to install libxshmfence (unspec'd ver; inspect with Debug::pkgMark-shallow)
[riscv64] MI2a: marked for install (shallow): libxshmfence
[riscv64] MI2a: satisfying Depends: libgbm = 4:26.0.5-alt1:sisyphus_riscv64+119825.200.1.1
[riscv64] MI2a: maybe install (a direct target): libgbm 4:26.0.5-alt1:sisyphus_riscv64+119825.200.1.1 at 1776771683
[riscv64] MI2a: target SELECTED: libgbm 4:26.0.5-alt1:sisyphus_riscv64+119825.200.1.1 at 1776771683
[riscv64] MI2a: requesting to install libgbm (unspec'd ver; inspect with Debug::pkgMark-shallow)
[riscv64] MI2a: marked for install (shallow): libgbm
[riscv64] MI2a: satisfying Depends: libGL = 7:1.7.0-alt1:sisyphus_riscv64+38766.100.1.1
[riscv64] MI2a: maybe install (a direct target): libGL 7:1.7.0-alt1:sisyphus_riscv64+38766.100.1.1 at 1696448292
[riscv64] MI2a: target SELECTED: libGL 7:1.7.0-alt1:sisyphus_riscv64+38766.100.1.1 at 1696448292
[riscv64] MI2a: requesting to install libGL (unspec'd ver; inspect with Debug::pkgMark-shallow)
[riscv64] MI2a: marked for install (shallow): libGL
[riscv64] MI2a: satisfying Depends: libGLX = 7:1.7.0-alt1:sisyphus_riscv64+38766.100.1.1
[riscv64] MI2a: maybe install (a direct target): libGLX 7:1.7.0-alt1:sisyphus_riscv64+38766.100.1.1 at 1696448292
[riscv64] MI2a: target SELECTED: libGLX 7:1.7.0-alt1:sisyphus_riscv64+38766.100.1.1 at 1696448292
[riscv64] MI2a: requesting to install libGLX (unspec'd ver; inspect with Debug::pkgMark-shallow)
[riscv64] MI2a: marked for install (shallow): libGLX
[riscv64] MI2a: satisfying Depends: libwayland-client-devel (NULL)
[riscv64] MI2a: maybe install (a direct target): libwayland-client-devel 1.25.0-alt1.1:sisyphus_riscv64+115618.100.1.2 at 1774026510
[riscv64] MI2a: target SELECTED: libwayland-client-devel 1.25.0-alt1.1:sisyphus_riscv64+115618.100.1.2 at 1774026510
[riscv64] MI2a: requesting to install libwayland-client-devel (unspec'd ver; inspect with Debug::pkgMark-shallow)
[riscv64] MI2a: marked for install (shallow): libwayland-client-devel
[riscv64] MI2a: satisfying Depends: wayland-devel = 1.25.0-alt1.1:sisyphus_riscv64+115618.100.1.2
[riscv64] MI2a: maybe install (a direct target): wayland-devel 1.25.0-alt1.1:sisyphus_riscv64+115618.100.1.2 at 1774026510
[riscv64] MI2a: target SELECTED: wayland-devel 1.25.0-alt1.1:sisyphus_riscv64+115618.100.1.2 at 1774026510
[riscv64] MI2a: requesting to install wayland-devel (unspec'd ver; inspect with Debug::pkgMark-shallow)
[riscv64] MI2a: marked for install (shallow): wayland-devel
[riscv64] MI2a: satisfying Depends: libva = 2.23.0-alt1:sisyphus_riscv64+104801.100.1.1
[riscv64] MI2a: maybe install (a direct target): libva 2.23.0-alt1:sisyphus_riscv64+104801.100.1.1 at 1766276072
[riscv64] MI2a: target SELECTED: libva 2.23.0-alt1:sisyphus_riscv64+104801.100.1.1 at 1766276072
[riscv64] MI2a: requesting to install libva (unspec'd ver; inspect with Debug::pkgMark-shallow)
[riscv64] MI2a: marked for install (shallow): libva
[riscv64] MI2a: satisfying Depends: libXfixes.so.3()(64bit) >= set:jhES5p94
[riscv64] MI2a: maybe install (a providing target): libXfixes 6.0.1-alt1:sisyphus_riscv64+39091.300.1.1 at 1697106312
[riscv64] MI2a: target SELECTED: libXfixes 6.0.1-alt1:sisyphus_riscv64+39091.300.1.1 at 1697106312
[riscv64] MI2a: requesting to install libXfixes (unspec'd ver; inspect with Debug::pkgMark-shallow)
[riscv64] MI2a: marked for install (shallow): libXfixes
[riscv64] MI2a: satisfying Depends: ocl-icd = 2.3.4-alt1:sisyphus_riscv64+104807.100.1.1
[riscv64] MI2a: maybe install (a direct target): ocl-icd 2.3.4-alt1:sisyphus_riscv64+104807.100.1.1 at 1766298109
[riscv64] MI2a: target SELECTED: ocl-icd 2.3.4-alt1:sisyphus_riscv64+104807.100.1.1 at 1766298109
[riscv64] MI2a: requesting to install ocl-icd (unspec'd ver; inspect with Debug::pkgMark-shallow)
[riscv64] MI2a: marked for install (shallow): ocl-icd
[riscv64] MI2a: marked for install (shallow): libheif-devel
[riscv64] MI2a: satisfying Depends: libheif = 1.21.2-alt1:sisyphus_riscv64+107297.100.1.1
[riscv64] MI2a: maybe install (a direct target): libheif 1.21.2-alt1:sisyphus_riscv64+107297.100.1.1 at 1768847509
[riscv64] MI2a: target SELECTED: libheif 1.21.2-alt1:sisyphus_riscv64+107297.100.1.1 at 1768847509
[riscv64] MI2a: requesting to install libheif (unspec'd ver; inspect with Debug::pkgMark-shallow)
[riscv64] MI2a: marked for install (shallow): libheif
[riscv64] MI2a: satisfying Depends: libSvtAv1Enc.so.1()(64bit) >= set:ieeVUvMs8RHJOenHRlOhbd
[riscv64] MI2a: maybe install (a providing target): libsvt-av1 1.8.0-alt1:sisyphus_riscv64+67330.4600.1.1 at 1734296149
[riscv64] MI2a: target SELECTED: libsvt-av1 1.8.0-alt1:sisyphus_riscv64+67330.4600.1.1 at 1734296149
[riscv64] MI2a: requesting to install libsvt-av1 (unspec'd ver; inspect with Debug::pkgMark-shallow)
[riscv64] MI2a: marked for install (shallow): libsvt-av1
[riscv64] MI2a: satisfying Depends: libaom.so.3()(64bit) >= set:jeg7LfNHEb2m3EVBzei2fn8vPyQE5TlK6qCKJh7zRNS8bi
[riscv64] MI2a: maybe install (a providing target): libaom3 3.13.1-alt1:sisyphus_riscv64+99054.100.1.1 at 1761689967
[riscv64] MI2a: target SELECTED: libaom3 3.13.1-alt1:sisyphus_riscv64+99054.100.1.1 at 1761689967
[riscv64] MI2a: requesting to install libaom3 (unspec'd ver; inspect with Debug::pkgMark-shallow)
[riscv64] MI2a: marked for install (shallow): libaom3
[riscv64] MI2a: satisfying Depends: libavcodec.so.62()(64bit) >= set:lhD78CQ29LHE6zJ2XdPLgfcD4hN2TOUUul4Os71
[riscv64] MI2a: maybe install (a providing target): libavcodec62 2:8.0.1-alt0.port.2:sisyphus_riscv64+118994.600.2.1 at 1776136867
[riscv64] MI2a: target SELECTED: libavcodec62 2:8.0.1-alt0.port.2:sisyphus_riscv64+118994.600.2.1 at 1776136867
[riscv64] MI2a: requesting to install libavcodec62 (unspec'd ver; inspect with Debug::pkgMark-shallow)
[riscv64] MI2a: marked for install (shallow): libavcodec62
[riscv64] MI2a: satisfying Depends: libcodec2.so.1.2()(64bit) >= set:nkMZE1R6vtiyZkbqVZFi8CGen
[riscv64] MI2a: maybe install (a providing target): libcodec2_1.2 1.2.0-alt1:sisyphus_riscv64+44721.100.1.1 at 1717162054
[riscv64] MI2a: target SELECTED: libcodec2_1.2 1.2.0-alt1:sisyphus_riscv64+44721.100.1.1 at 1717162054
[riscv64] MI2a: requesting to install libcodec2_1.2 (unspec'd ver; inspect with Debug::pkgMark-shallow)
[riscv64] MI2a: marked for install (shallow): libcodec2_1.2
[riscv64] MI2a: satisfying Depends: libdav1d.so.7()(64bit) >= set:ie1lvHDD7QXezwBwEtraeGZxzKusC7i3
[riscv64] MI2a: maybe install (a providing target): libdav1d_7 1.5.3-alt1:sisyphus_riscv64+105902.100.1.1 at 1767471820
[riscv64] MI2a: target SELECTED: libdav1d_7 1.5.3-alt1:sisyphus_riscv64+105902.100.1.1 at 1767471820
[riscv64] MI2a: requesting to install libdav1d_7 (unspec'd ver; inspect with Debug::pkgMark-shallow)
[riscv64] MI2a: marked for install (shallow): libdav1d_7
[riscv64] MI2a: satisfying Depends: libgsm.so.1()(64bit) >= set:jgcPigthR0fltf9
[riscv64] MI2a: maybe install (a providing target): libgsm 1.0.24-alt1:sisyphus_riscv64+115671.100.1.1 at 1774049192
[riscv64] MI2a: target SELECTED: libgsm 1.0.24-alt1:sisyphus_riscv64+115671.100.1.1 at 1774049192
[riscv64] MI2a: requesting to install libgsm (unspec'd ver; inspect with Debug::pkgMark-shallow)
[riscv64] MI2a: marked for install (shallow): libgsm
[riscv64] MI2a: satisfying Depends: libmp3lame.so.0()(64bit) >= set:lgqnMGw3qQUqHaFvZHAHN1JfFQcGN0GMdANSvRnHt6KZ8rlBi74kxCAj0EDb
[riscv64] MI2a: maybe install (a providing target): liblame 3.100-alt1:sisyphus_riscv64+49341.100.1.1 at 1716593398
[riscv64] MI2a: target SELECTED: liblame 3.100-alt1:sisyphus_riscv64+49341.100.1.1 at 1716593398
[riscv64] MI2a: requesting to install liblame (unspec'd ver; inspect with Debug::pkgMark-shallow)
[riscv64] MI2a: marked for install (shallow): liblame
[riscv64] MI2a: satisfying Depends: libopencore-amrnb.so.0()(64bit) >= set:gdOBXM43uy7WTd
[riscv64] MI2a: maybe install (a providing target): libopencore-amrnb0 0.1.6-alt1:sisyphus_riscv64+24683.100.1.1 at 1665089152
[riscv64] MI2a: target SELECTED: libopencore-amrnb0 0.1.6-alt1:sisyphus_riscv64+24683.100.1.1 at 1665089152
[riscv64] MI2a: requesting to install libopencore-amrnb0 (unspec'd ver; inspect with Debug::pkgMark-shallow)
[riscv64] MI2a: marked for install (shallow): libopencore-amrnb0
[riscv64] MI2a: satisfying Depends: libopencore-amrwb.so.0()(64bit) >= set:fdDrfO16
[riscv64] MI2a: maybe install (a providing target): libopencore-amrwb0 0.1.6-alt1:sisyphus_riscv64+24683.100.1.1 at 1665089152
[riscv64] MI2a: target SELECTED: libopencore-amrwb0 0.1.6-alt1:sisyphus_riscv64+24683.100.1.1 at 1665089152
[riscv64] MI2a: requesting to install libopencore-amrwb0 (unspec'd ver; inspect with Debug::pkgMark-shallow)
[riscv64] MI2a: marked for install (shallow): libopencore-amrwb0
[riscv64] MI2a: satisfying Depends: libopenh264.so.7()(64bit) >= set:olSyCJTJj2QxzJj
[riscv64] MI2a: maybe install (a providing target): libopenh264_7 2.6.0-alt2:sisyphus_riscv64+77433.100.1.1 at 1742917115
[riscv64] MI2a: target SELECTED: libopenh264_7 2.6.0-alt2:sisyphus_riscv64+77433.100.1.1 at 1742917115
[riscv64] MI2a: requesting to install libopenh264_7 (unspec'd ver; inspect with Debug::pkgMark-shallow)
[riscv64] MI2a: marked for install (shallow): libopenh264_7
[riscv64] MI2a: satisfying Depends: libopus.so.0()(64bit) >= set:kgmsKyWd4MKIZIZ0ZumpF8qoXHEFZhGF4
[riscv64] MI2a: maybe install (a providing target): libopus0 1.6.1-alt2:sisyphus_riscv64+111691.100.1.1 at 1771944443
[riscv64] MI2a: target SELECTED: libopus0 1.6.1-alt2:sisyphus_riscv64+111691.100.1.1 at 1771944443
[riscv64] MI2a: requesting to install libopus0 (unspec'd ver; inspect with Debug::pkgMark-shallow)
[riscv64] MI2a: marked for install (shallow): libopus0
[riscv64] MI2a: satisfying Depends: librav1e.so.0()(64bit) >= set:jep5GwNX9bhCdFpZLMz2DtZ2051IpGJRTnwiAQ2h4i3yiZJDsgaM0
[riscv64] MI2a: maybe install (a providing target): librav1e 0.8.1-alt1:sisyphus_riscv64+86655.100.1.1 at 1750181657
[riscv64] MI2a: target SELECTED: librav1e 0.8.1-alt1:sisyphus_riscv64+86655.100.1.1 at 1750181657
[riscv64] MI2a: requesting to install librav1e (unspec'd ver; inspect with Debug::pkgMark-shallow)
[riscv64] MI2a: marked for install (shallow): librav1e
[riscv64] MI2a: satisfying Depends: librsvg-2.so.2()(64bit) >= set:jhdbNizIP3
[riscv64] MI2a: maybe install (a providing target): librsvg 1:2.62.1-alt1:sisyphus_riscv64+116538.400.2.1 at 1774598547
[riscv64] MI2a: target SELECTED: librsvg 1:2.62.1-alt1:sisyphus_riscv64+116538.400.2.1 at 1774598547
[riscv64] MI2a: requesting to install librsvg (unspec'd ver; inspect with Debug::pkgMark-shallow)
[riscv64] MI2a: marked for install (shallow): librsvg
[riscv64] MI2a: satisfying Depends: libcairo-gobject.so.2()(64bit) (NULL)
[riscv64] MI2a: maybe install (a providing target): libcairo-gobject 1:1.18.4-alt1:sisyphus_riscv64+75640.100.1.1 at 1741606770
[riscv64] MI2a: target SELECTED: libcairo-gobject 1:1.18.4-alt1:sisyphus_riscv64+75640.100.1.1 at 1741606770
[riscv64] MI2a: requesting to install libcairo-gobject (unspec'd ver; inspect with Debug::pkgMark-shallow)
[riscv64] MI2a: marked for install (shallow): libcairo-gobject
[riscv64] MI2a: satisfying Depends: libgdk_pixbuf-2.0.so.0()(64bit) >= set:lhnL2YqjK4iFap3mBrJgIQzNZJ9
[riscv64] MI2a: maybe install (a providing target): libgdk-pixbuf 2.44.4-alt1:sisyphus_riscv64+98328.100.1.1 at 1761510614
[riscv64] MI2a: target SELECTED: libgdk-pixbuf 2.44.4-alt1:sisyphus_riscv64+98328.100.1.1 at 1761510614
[riscv64] MI2a: requesting to install libgdk-pixbuf (unspec'd ver; inspect with Debug::pkgMark-shallow)
[riscv64] MI2a: marked for install (shallow): libgdk-pixbuf
[riscv64] MI2a: satisfying Depends: shared-mime-info (NULL)
[riscv64] MI2a: maybe install (a direct target): shared-mime-info 2.4-alt1.1:sisyphus_riscv64+98006.100.1.1 at 1761452959
[riscv64] MI2a: target SELECTED: shared-mime-info 2.4-alt1.1:sisyphus_riscv64+98006.100.1.1 at 1761452959
[riscv64] MI2a: requesting to install shared-mime-info (unspec'd ver; inspect with Debug::pkgMark-shallow)
[riscv64] MI2a: marked for install (shallow): shared-mime-info
[riscv64] MI2a: satisfying Depends: libgio-2.0.so.0()(64bit) >= set:pjDU5hCMes3frfS8DFVJ4TCzx6CkbX3v6T7lq2T2ns17pqjPxrOM3PRbis0EwWc4BmYFEAE8nRdlD0F0ZsyVS2ct1aB83XTlcgGRdqtCCeUM94Ne70NFBO2xokLEPSTB0Xm7
[riscv64] MI2a: maybe install (a providing target): libgio 2.88.0-alt1:sisyphus_riscv64+115074.100.1.1 at 1773735024
[riscv64] MI2a: target SELECTED: libgio 2.88.0-alt1:sisyphus_riscv64+115074.100.1.1 at 1773735024
[riscv64] MI2a: requesting to install libgio (unspec'd ver; inspect with Debug::pkgMark-shallow)
[riscv64] MI2a: marked for install (shallow): libgio
[riscv64] MI2a: satisfying Depends: gsettings-desktop-schemas (NULL)
[riscv64] MI2a: maybe install (a direct target): gsettings-desktop-schemas 50.1-alt1:sisyphus_riscv64+119263.100.1.1 at 1776369800
[riscv64] MI2a: target SELECTED: gsettings-desktop-schemas 50.1-alt1:sisyphus_riscv64+119263.100.1.1 at 1776369800
[riscv64] MI2a: requesting to install gsettings-desktop-schemas (unspec'd ver; inspect with Debug::pkgMark-shallow)
[riscv64] MI2a: marked for install (shallow): gsettings-desktop-schemas
[riscv64] MI2a: satisfying Depends: gsettings-desktop-schemas-data = 50.1-alt1:sisyphus_riscv64+119263.100.1.1
[riscv64] MI2a: maybe install (a direct target): gsettings-desktop-schemas-data 50.1-alt1:sisyphus_riscv64+119263.100.1.1 at 1776369800
[riscv64] MI2a: target SELECTED: gsettings-desktop-schemas-data 50.1-alt1:sisyphus_riscv64+119263.100.1.1 at 1776369800
[riscv64] MI2a: requesting to install gsettings-desktop-schemas-data (unspec'd ver; inspect with Debug::pkgMark-shallow)
[riscv64] MI2a: marked for install (shallow): gsettings-desktop-schemas-data
[riscv64] MI2a: satisfying Depends: /usr/bin/update-desktop-database (NULL)
[riscv64] MI2a: maybe install (a providing target): desktop-file-utils 0.26-alt6:sisyphus_riscv64+39350.100.1.1 at 1697747180
[riscv64] MI2a: target SELECTED: desktop-file-utils 0.26-alt6:sisyphus_riscv64+39350.100.1.1 at 1697747180
[riscv64] MI2a: requesting to install desktop-file-utils (unspec'd ver; inspect with Debug::pkgMark-shallow)
[riscv64] MI2a: marked for install (shallow): desktop-file-utils
[riscv64] MI2a: satisfying Depends: libgdk-pixbuf-locales = 2.44.4-alt1:sisyphus_riscv64+98328.100.1.1
[riscv64] MI2a: maybe install (a direct target): libgdk-pixbuf-locales 2.44.4-alt1:sisyphus_riscv64+98328.100.1.1 at 1761510614
[riscv64] MI2a: target SELECTED: libgdk-pixbuf-locales 2.44.4-alt1:sisyphus_riscv64+98328.100.1.1 at 1761510614
[riscv64] MI2a: requesting to install libgdk-pixbuf-locales (unspec'd ver; inspect with Debug::pkgMark-shallow)
[riscv64] MI2a: marked for install (shallow): libgdk-pixbuf-locales
[riscv64] MI2a: satisfying Depends: libpango-1.0.so.0()(64bit) >= set:mgPmZotHfPiCXWF71YllU7bJhHoadoPLsCzcZGC6a6E9yoEEqAUtfcPLCtxgAjAkRx5NSg2lHCleIAA7kRgqrdj9wZDVhJCYB5dGxbRviPpF49ED7hKlXWJZFG6Hrc7vfWE5d0
[riscv64] MI2a: maybe install (a providing target): libpango 1.57.0-alt1:sisyphus_riscv64+93484.100.1.1 at 1756425285
[riscv64] MI2a: target SELECTED: libpango 1.57.0-alt1:sisyphus_riscv64+93484.100.1.1 at 1756425285
[riscv64] MI2a: requesting to install libpango (unspec'd ver; inspect with Debug::pkgMark-shallow)
[riscv64] MI2a: marked for install (shallow): libpango
[riscv64] MI2a: satisfying Depends: libXft.so.2()(64bit) >= set:kf9t6L7MThfHAWOhLIew81ReFZ7VgLrqZ3CMlWVx8doBZyt0
[riscv64] MI2a: maybe install (a providing target): libXft 2.3.8-alt1:sisyphus_riscv64+39091.400.1.1 at 1697106654
[riscv64] MI2a: target SELECTED: libXft 2.3.8-alt1:sisyphus_riscv64+39091.400.1.1 at 1697106654
[riscv64] MI2a: requesting to install libXft (unspec'd ver; inspect with Debug::pkgMark-shallow)
[riscv64] MI2a: marked for install (shallow): libXft
[riscv64] MI2a: satisfying Depends: libfribidi.so.0()(64bit) >= set:jh9afmmAt1
[riscv64] MI2a: maybe install (a providing target): libfribidi 1.0.16-alt1:sisyphus_riscv64+53771.100.1.1 at 1727352552
[riscv64] MI2a: target SELECTED: libfribidi 1.0.16-alt1:sisyphus_riscv64+53771.100.1.1 at 1727352552
[riscv64] MI2a: requesting to install libfribidi (unspec'd ver; inspect with Debug::pkgMark-shallow)
[riscv64] MI2a: marked for install (shallow): libfribidi
[riscv64] MI2a: satisfying Depends: libthai.so.0()(64bit) >= set:kiZ8jZ7Zs620
[riscv64] MI2a: maybe install (a providing target): libthai 0.1.29-alt1_6:sisyphus_riscv64+37142.100.1.1 at 1693476232
[riscv64] MI2a: target SELECTED: libthai 0.1.29-alt1_6:sisyphus_riscv64+37142.100.1.1 at 1693476232
[riscv64] MI2a: requesting to install libthai (unspec'd ver; inspect with Debug::pkgMark-shallow)
[riscv64] MI2a: marked for install (shallow): libthai
[riscv64] MI2a: satisfying Depends: libdatrie.so.1()(64bit) >= set:jfRmFHpKayG4TnsrZu7OK4Wprc
[riscv64] MI2a: maybe install (a providing target): libdatrie 0.2.14-alt1:sisyphus_riscv64+102668.100.1.1 at 1764793702
[riscv64] MI2a: target SELECTED: libdatrie 0.2.14-alt1:sisyphus_riscv64+102668.100.1.1 at 1764793702
[riscv64] MI2a: requesting to install libdatrie (unspec'd ver; inspect with Debug::pkgMark-shallow)
[riscv64] MI2a: marked for install (shallow): libdatrie
[riscv64] MI2a: satisfying Depends: libsnappy.so.1()(64bit) >= set:kiljlrg3
[riscv64] MI2a: maybe install (a providing target): libsnappy1 1.2.2-alt2:sisyphus_riscv64+110125.100.1.1 at 1770753461
[riscv64] MI2a: target SELECTED: libsnappy1 1.2.2-alt2:sisyphus_riscv64+110125.100.1.1 at 1770753461
[riscv64] MI2a: requesting to install libsnappy1 (unspec'd ver; inspect with Debug::pkgMark-shallow)
[riscv64] MI2a: marked for install (shallow): libsnappy1
[riscv64] MI2a: satisfying Depends: libspeex.so.1()(64bit) >= set:jepiRJAhEL9Z2R31WgbMBy1SCTkoVNcxaGJdyzkf5gsqlleZtcH6rfZa8f2
[riscv64] MI2a: maybe install (a providing target): libspeex 1.2.1-alt1:sisyphus_riscv64+44132.100.1.1 at 1709348383
[riscv64] MI2a: target SELECTED: libspeex 1.2.1-alt1:sisyphus_riscv64+44132.100.1.1 at 1709348383
[riscv64] MI2a: requesting to install libspeex (unspec'd ver; inspect with Debug::pkgMark-shallow)
[riscv64] MI2a: marked for install (shallow): libspeex
[riscv64] MI2a: satisfying Depends: libtheoradec.so.1()(64bit) >= set:jgVggzsWIFJj
[riscv64] MI2a: maybe install (a providing target): libtheora 2:1.1.1-alt6:sisyphus_riscv64+9474.100.1.1 at 1634407541
[riscv64] MI2a: target SELECTED: libtheora 2:1.1.1-alt6:sisyphus_riscv64+9474.100.1.1 at 1634407541
[riscv64] MI2a: requesting to install libtheora (unspec'd ver; inspect with Debug::pkgMark-shallow)
[riscv64] MI2a: marked for install (shallow): libtheora
[riscv64] MI2a: satisfying Depends: libogg.so.0()(64bit) >= set:kgIZhNqTw34T1xQo68cgpXF
[riscv64] MI2a: maybe install (a providing target): libogg 1.3.5-alt1:sisyphus_riscv64+9340.100.1.1 at 1634311674
[riscv64] MI2a: target SELECTED: libogg 1.3.5-alt1:sisyphus_riscv64+9340.100.1.1 at 1634311674
[riscv64] MI2a: requesting to install libogg (unspec'd ver; inspect with Debug::pkgMark-shallow)
[riscv64] MI2a: marked for install (shallow): libogg
[riscv64] MI2a: satisfying Depends: libtwolame.so.0()(64bit) >= set:kfLKeo0KwWRJelYSAVCh56vpNoeegbmFsSeYZw1PM29DXOgRMrJ4
[riscv64] MI2a: maybe install (a providing target): libtwolame 0.4.0-alt1:sisyphus_riscv64+12639.100.1.1 at 1636612839
[riscv64] MI2a: target SELECTED: libtwolame 0.4.0-alt1:sisyphus_riscv64+12639.100.1.1 at 1636612839
[riscv64] MI2a: requesting to install libtwolame (unspec'd ver; inspect with Debug::pkgMark-shallow)
[riscv64] MI2a: marked for install (shallow): libtwolame
[riscv64] MI2a: satisfying Depends: libvorbis.so.0()(64bit) >= set:jey3HPOjOJNIiU1bvVJ9KPlLRlNCC5ZdM5ooW3W7sHE46yhpB5
[riscv64] MI2a: maybe install (a providing target): libvorbis 1.3.7-alt1:sisyphus_riscv64+9478.100.1.1 at 1634408651
[riscv64] MI2a: target SELECTED: libvorbis 1.3.7-alt1:sisyphus_riscv64+9478.100.1.1 at 1634408651
[riscv64] MI2a: requesting to install libvorbis (unspec'd ver; inspect with Debug::pkgMark-shallow)
[riscv64] MI2a: marked for install (shallow): libvorbis
[riscv64] MI2a: satisfying Depends: libvpx.so.12()(64bit) >= set:jeMZo94aN9QZJxycS1aAZhV6SAnOeCDPzIObRHOcZof2xbQkZosX2
[riscv64] MI2a: maybe install (a providing target): libvpx12 1.16.0-alt0.port:sisyphus_riscv64+118994.100.1.1 at 1776112351
[riscv64] MI2a: target SELECTED: libvpx12 1.16.0-alt0.port:sisyphus_riscv64+118994.100.1.1 at 1776112351
[riscv64] MI2a: requesting to install libvpx12 (unspec'd ver; inspect with Debug::pkgMark-shallow)
[riscv64] MI2a: marked for install (shallow): libvpx12
[riscv64] MI2a: satisfying Depends: libx264.so.164()(64bit) >= set:jfZKMMnY1bqAvVapnao0qpm2u6KIgqZIiqQE3
[riscv64] MI2a: maybe install (a providing target): libx264 164-alt1.1:sisyphus_riscv64+33411.100.1.1 at 1685591564
[riscv64] MI2a: target SELECTED: libx264 164-alt1.1:sisyphus_riscv64+33411.100.1.1 at 1685591564
[riscv64] MI2a: requesting to install libx264 (unspec'd ver; inspect with Debug::pkgMark-shallow)
[riscv64] MI2a: marked for install (shallow): libx264
[riscv64] MI2a: satisfying Depends: libx265.so.215()(64bit) >= set:onuRta
[riscv64] MI2a: maybe install (a providing target): libx265-215 4.1-alt2:sisyphus_riscv64+86894.100.1.1 at 1750359758
[riscv64] MI2a: target SELECTED: libx265-215 4.1-alt2:sisyphus_riscv64+86894.100.1.1 at 1750359758
[riscv64] MI2a: requesting to install libx265-215 (unspec'd ver; inspect with Debug::pkgMark-shallow)
[riscv64] MI2a: marked for install (shallow): libx265-215
[riscv64] MI2a: satisfying Depends: libnuma.so.1()(64bit) >= set:kgaNvnatKNxUJx8kxNk8XlGBKVg
[riscv64] MI2a: maybe install (a providing target): libnuma 2.0.19-alt1:sisyphus_riscv64+66055.100.1.1 at 1733149619
[riscv64] MI2a: target SELECTED: libnuma 2.0.19-alt1:sisyphus_riscv64+66055.100.1.1 at 1733149619
[riscv64] MI2a: requesting to install libnuma (unspec'd ver; inspect with Debug::pkgMark-shallow)
[riscv64] MI2a: marked for install (shallow): libnuma
[riscv64] MI2a: satisfying Depends: libxvidcore.so.4()(64bit) >= set:hedlrCs99fCpG5e
[riscv64] MI2a: maybe install (a providing target): libxvid 1.3.7-alt1:sisyphus_riscv64+14718.100.1.1 at 1640955455
[riscv64] MI2a: target SELECTED: libxvid 1.3.7-alt1:sisyphus_riscv64+14718.100.1.1 at 1640955455
[riscv64] MI2a: requesting to install libxvid (unspec'd ver; inspect with Debug::pkgMark-shallow)
[riscv64] MI2a: marked for install (shallow): libxvid
[riscv64] MI2a: satisfying Depends: libzvbi.so.0()(64bit) >= set:miFwpafDn6tJTzdZmLBYF5yBthPSq6VWMZBjVK1
[riscv64] MI2a: maybe install (a providing target): libzvbi 0.2.44-alt1:sisyphus_riscv64+96909.100.1.1 at 1760998952
[riscv64] MI2a: target SELECTED: libzvbi 0.2.44-alt1:sisyphus_riscv64+96909.100.1.1 at 1760998952
[riscv64] MI2a: requesting to install libzvbi (unspec'd ver; inspect with Debug::pkgMark-shallow)
[riscv64] MI2a: marked for install (shallow): libzvbi
[riscv64] MI2a: satisfying Depends: libswresample6 = 2:8.0.1-alt0.port.2:sisyphus_riscv64+118994.600.2.1
[riscv64] MI2a: maybe install (a direct target): libswresample6 2:8.0.1-alt0.port.2:sisyphus_riscv64+118994.600.2.1 at 1776136867
[riscv64] MI2a: target SELECTED: libswresample6 2:8.0.1-alt0.port.2:sisyphus_riscv64+118994.600.2.1 at 1776136867
[riscv64] MI2a: requesting to install libswresample6 (unspec'd ver; inspect with Debug::pkgMark-shallow)
[riscv64] MI2a: marked for install (shallow): libswresample6
[riscv64] MI2a: satisfying Depends: libsoxr.so.0()(64bit) >= set:ieM1h5LhloUy47Fq1eRI
[riscv64] MI2a: maybe install (a providing target): libsoxr 0.1.3-alt1.1:sisyphus_riscv64+31196.100.1.1 at 1680465695
[riscv64] MI2a: target SELECTED: libsoxr 0.1.3-alt1.1:sisyphus_riscv64+31196.100.1.1 at 1680465695
[riscv64] MI2a: requesting to install libsoxr (unspec'd ver; inspect with Debug::pkgMark-shallow)
[riscv64] MI2a: marked for install (shallow): libsoxr
[riscv64] MI2a: satisfying Depends: libavutil60 = 2:8.0.1-alt0.port.2:sisyphus_riscv64+118994.600.2.1
[riscv64] MI2a: maybe install (a direct target): libavutil60 2:8.0.1-alt0.port.2:sisyphus_riscv64+118994.600.2.1 at 1776136867
[riscv64] MI2a: target SELECTED: libavutil60 2:8.0.1-alt0.port.2:sisyphus_riscv64+118994.600.2.1 at 1776136867
[riscv64] MI2a: requesting to install libavutil60 (unspec'd ver; inspect with Debug::pkgMark-shallow)
[riscv64] MI2a: marked for install (shallow): libavutil60
[riscv64] MI2a: satisfying Depends: libvdpau.so.1()(64bit) >= set:dcVd
[riscv64] MI2a: maybe install (a providing target): libvdpau 1:1.5-alt1:sisyphus_riscv64+18782.100.1.1 at 1649430463
[riscv64] MI2a: target SELECTED: libvdpau 1:1.5-alt1:sisyphus_riscv64+18782.100.1.1 at 1649430463
[riscv64] MI2a: requesting to install libvdpau (unspec'd ver; inspect with Debug::pkgMark-shallow)
[riscv64] MI2a: marked for install (shallow): libvdpau
[riscv64] MI2a: satisfying Depends: libde265.so.0()(64bit) >= set:niuvtyEfjInOZnOZHzscXliwgxQcfb3yU2zeTouk4tOA2sd3QkGMIGkIEdIO1K1
[riscv64] MI2a: maybe install (a providing target): libde265 1.0.16-alt1:sisyphus_riscv64+86779.100.1.1 at 1750280040
[riscv64] MI2a: target SELECTED: libde265 1.0.16-alt1:sisyphus_riscv64+86779.100.1.1 at 1750280040
[riscv64] MI2a: requesting to install libde265 (unspec'd ver; inspect with Debug::pkgMark-shallow)
[riscv64] MI2a: marked for install (shallow): libde265
[riscv64] MI2a: satisfying Depends: libkvazaar.so.7()(64bit) >= set:dcZ6
[riscv64] MI2a: maybe install (a providing target): libkvazaar7 2.2.0-alt1:sisyphus_riscv64+67312.6100.1.1 at 1734214841
[riscv64] MI2a: target SELECTED: libkvazaar7 2.2.0-alt1:sisyphus_riscv64+67312.6100.1.1 at 1734214841
[riscv64] MI2a: requesting to install libkvazaar7 (unspec'd ver; inspect with Debug::pkgMark-shallow)
[riscv64] MI2a: marked for install (shallow): libkvazaar7
[riscv64] MI2a: marked for install (shallow): libpoppler-devel
[riscv64] MI2a: satisfying Depends: libpoppler156 = 26.01.0-alt1:sisyphus_riscv64+115497.100.1.1
[riscv64] MI2a: maybe install (a direct target): libpoppler156 26.01.0-alt1:sisyphus_riscv64+115497.100.1.1 at 1773948057
[riscv64] MI2a: target SELECTED: libpoppler156 26.01.0-alt1:sisyphus_riscv64+115497.100.1.1 at 1773948057
[riscv64] MI2a: requesting to install libpoppler156 (unspec'd ver; inspect with Debug::pkgMark-shallow)
[riscv64] MI2a: marked for install (shallow): libpoppler156
[riscv64] MI2a: satisfying Depends: poppler-data (NULL)
[riscv64] MI2a: maybe install (a direct target): poppler-data 0.4.12-alt1:sisyphus_riscv64+33379.100.1.1 at 1685571735
[riscv64] MI2a: target SELECTED: poppler-data 0.4.12-alt1:sisyphus_riscv64+33379.100.1.1 at 1685571735
[riscv64] MI2a: requesting to install poppler-data (unspec'd ver; inspect with Debug::pkgMark-shallow)
[riscv64] MI2a: marked for install (shallow): poppler-data
[riscv64] MI2a: satisfying Depends: libcsp_c_bridge.so.0()(64bit) >= set:jhcvy0o1
[riscv64] MI2a: maybe install (a providing target): libaltcsp 0.4.0-alt2:sisyphus_riscv64+106717.100.1.1 at 1768395678
[riscv64] MI2a: target SELECTED: libaltcsp 0.4.0-alt2:sisyphus_riscv64+106717.100.1.1 at 1768395678
[riscv64] MI2a: requesting to install libaltcsp (unspec'd ver; inspect with Debug::pkgMark-shallow)
[riscv64] MI2a: marked for install (shallow): libaltcsp
[riscv64] MI2a: satisfying Depends: libboost_locale.so.1.86.0()(64bit) >= set:mlyqQ0
[riscv64] MI2a: maybe install (a providing target): libboost_locale1.86.0 1:1.86.0-alt3:sisyphus_riscv64+96790.120500.15.1 at 1760672167
[riscv64] MI2a: target SELECTED: libboost_locale1.86.0 1:1.86.0-alt3:sisyphus_riscv64+96790.120500.15.1 at 1760672167
[riscv64] MI2a: requesting to install libboost_locale1.86.0 (unspec'd ver; inspect with Debug::pkgMark-shallow)
[riscv64] MI2a: marked for install (shallow): libboost_locale1.86.0
[riscv64] MI2a: satisfying Depends: libicui18n.so.76()(64bit) >= set:rlPItUbEXWA6ExI9VZx3OrJCSvMOsMkBT69TMNqIipG2dkZ13InxrsVA1RxAvRPM8FkofVnD0G9f5RR5pDrOjmbpLcwTbK4eCkTR9LsFKjg6aANSmprfrYGMqqSb8Yk3
[riscv64] MI2a: maybe install (a providing target): libicu76 1:7.6.1-alt1:sisyphus_riscv64+74138.100.1.1 at 1740321561
[riscv64] MI2a: target SELECTED: libicu76 1:7.6.1-alt1:sisyphus_riscv64+74138.100.1.1 at 1740321561
[riscv64] MI2a: requesting to install libicu76 (unspec'd ver; inspect with Debug::pkgMark-shallow)
[riscv64] MI2a: marked for install (shallow): libicu76
[riscv64] MI2a: satisfying Depends: libfmt.so.12()(64bit) >= set:jhmHJXC2
[riscv64] MI2a: maybe install (a providing target): libfmt12 1:12.1.0-alt1.2:sisyphus_riscv64+104284.100.1.1 at 1765832878
[riscv64] MI2a: target SELECTED: libfmt12 1:12.1.0-alt1.2:sisyphus_riscv64+104284.100.1.1 at 1765832878
[riscv64] MI2a: requesting to install libfmt12 (unspec'd ver; inspect with Debug::pkgMark-shallow)
[riscv64] MI2a: marked for install (shallow): libfmt12
[riscv64] MI2a: satisfying Depends: libglibmm-2.4.so.1()(64bit) >= set:okhDGUVMNXZm7DlLxc8to5tWr55n
[riscv64] MI2a: maybe install (a providing target): libglibmm 2.66.8-alt1:sisyphus_riscv64+77282.100.1.1 at 1742821420
[riscv64] MI2a: target SELECTED: libglibmm 2.66.8-alt1:sisyphus_riscv64+77282.100.1.1 at 1742821420
[riscv64] MI2a: requesting to install libglibmm (unspec'd ver; inspect with Debug::pkgMark-shallow)
[riscv64] MI2a: marked for install (shallow): libglibmm
[riscv64] MI2a: satisfying Depends: libsigc-2.0.so.0()(64bit) >= set:kfmnIZrbqeg3XEBqNWyXZpuAY2i0EYs2wWlGAu8NxLme7g5AkNofXQNHROGm24IV4
[riscv64] MI2a: maybe install (a providing target): libsigc++2 2.12.1-alt1:sisyphus_riscv64+38825.100.1.1 at 1696543070
[riscv64] MI2a: target SELECTED: libsigc++2 2.12.1-alt1:sisyphus_riscv64+38825.100.1.1 at 1696543070
[riscv64] MI2a: requesting to install libsigc++2 (unspec'd ver; inspect with Debug::pkgMark-shallow)
[riscv64] MI2a: marked for install (shallow): libsigc++2
[riscv64] MI2a: satisfying Depends: libxml++-3.0.so.1()(64bit) >= set:njXWlFAPtRANekhvJE96ehjcU3nLg7esbm6TMvvDX7E7b7
[riscv64] MI2a: maybe install (a providing target): libxml++3 3.2.5-alt1:sisyphus_riscv64+43234.200.1.1 at 1708393331
[riscv64] MI2a: target SELECTED: libxml++3 3.2.5-alt1:sisyphus_riscv64+43234.200.1.1 at 1708393331
[riscv64] MI2a: requesting to install libxml++3 (unspec'd ver; inspect with Debug::pkgMark-shallow)
[riscv64] MI2a: marked for install (shallow): libxml++3
[riscv64] MI2a: satisfying Depends: libzip.so.5()(64bit) >= set:kf0aaiSfWWy6PdTI8s2JRtK8Zdnnu9VhfOByqBAr4
[riscv64] MI2a: maybe install (a providing target): libzip5 1.11.4-alt1:sisyphus_riscv64+89029.100.1.1 at 1752176953
[riscv64] MI2a: target SELECTED: libzip5 1.11.4-alt1:sisyphus_riscv64+89029.100.1.1 at 1752176953
[riscv64] MI2a: requesting to install libzip5 (unspec'd ver; inspect with Debug::pkgMark-shallow)
[riscv64] MI2a: marked for install (shallow): libzip5
[riscv64] MI2a: satisfying Depends: libgpgmepp.so.6()(64bit) >= set:nh6Wi1seE240ucsbPpDQUfF9dwbC9nfoj0XL6GFQLgcnZsRk1ReKqr7KtBLqbUgKlLwmeER8tYn74kHkmorx2WUJL4eQHrAZD2zPPRuMokVZy4K7SSRT7kDDT5Gqn3wRxn8Yqe6rd
[riscv64] MI2a: maybe install (a providing target): libgpgmepp6 1.24.3-alt1:sisyphus_riscv64+97416.100.1.1 at 1761237071
[riscv64] MI2a: target SELECTED: libgpgmepp6 1.24.3-alt1:sisyphus_riscv64+97416.100.1.1 at 1761237071
[riscv64] MI2a: requesting to install libgpgmepp6 (unspec'd ver; inspect with Debug::pkgMark-shallow)
[riscv64] MI2a: marked for install (shallow): libgpgmepp6
[riscv64] MI2a: satisfying Depends: libgpgme11 = 1.24.3-alt1:sisyphus_riscv64+97416.100.1.1
[riscv64] MI2a: maybe install (a direct target): libgpgme11 1.24.3-alt1:sisyphus_riscv64+97416.100.1.1 at 1761237071
[riscv64] MI2a: target SELECTED: libgpgme11 1.24.3-alt1:sisyphus_riscv64+97416.100.1.1 at 1761237071
[riscv64] MI2a: requesting to install libgpgme11 (unspec'd ver; inspect with Debug::pkgMark-shallow)
[riscv64] MI2a: marked for install (shallow): libgpgme11
[riscv64] MI2a: satisfying Depends: gpgme-common >= 1.24.3-alt1
[riscv64] MI2a: maybe install (a direct target): gpgme-common 1.24.3-alt1:sisyphus_riscv64+97416.100.1.1 at 1761237071
[riscv64] MI2a: target SELECTED: gpgme-common 1.24.3-alt1:sisyphus_riscv64+97416.100.1.1 at 1761237071
[riscv64] MI2a: requesting to install gpgme-common (unspec'd ver; inspect with Debug::pkgMark-shallow)
[riscv64] MI2a: marked for install (shallow): gpgme-common
[riscv64] MI2a: satisfying Depends: /usr/bin/gpg2 (NULL)
[riscv64] MI2a: maybe install (a providing target): gnupg2 2.4.3-alt1:sisyphus_riscv64+49225.100.1.1 at 1716535660
[riscv64] MI2a: target SELECTED: gnupg2 2.4.3-alt1:sisyphus_riscv64+49225.100.1.1 at 1716535660
[riscv64] MI2a: requesting to install gnupg2 (unspec'd ver; inspect with Debug::pkgMark-shallow)
[riscv64] MI2a: marked for install (shallow): gnupg2
[riscv64] MI2a: satisfying Depends: libassuan2.so.0()(64bit) >= set:kdTj18aV79AnslxNNYPpCkhYo8bWjEwdrXB49GzIfbAeu7FAsAGT18ZBDqEArMs82oRiGXqIDZGA5pkFCqs0knSl0p40qkmNp6wGobpqAxnCQoSfNaUdIYzHOeF8hDHsiiZ00E9gPrs7NFMZL1NHd3
[riscv64] MI2a: maybe install (a providing target): libassuan 2.5.6-alt1:sisyphus_riscv64+36515.300.1.1 at 1692111592
[riscv64] MI2a: target SELECTED: libassuan 2.5.6-alt1:sisyphus_riscv64+36515.300.1.1 at 1692111592
[riscv64] MI2a: requesting to install libassuan (unspec'd ver; inspect with Debug::pkgMark-shallow)
[riscv64] MI2a: marked for install (shallow): libassuan
[riscv64] MI2a: satisfying Depends: libksba.so.8()(64bit) >= set:leGMIZfIy8N6Cap7yZ8sCClknRYwdvrMu5jkEpHsF8mxoZ6n3Zsp7R0XZ6m1ew6UtqOsiKNMYkU2R7wUBQGpLZ1SLsNyBCwCAS9z7PSz8nfYhPLZejBvJ5vFkJoy88iERFe7exAWaWjgNpkZhyOlg81Ezn2jGga8O0qBTXzvmZsjMkffZybJBcy7txJpAJBSwowhTImBbEBK0f98IGIEBGfXcgsXCoR7ZvuipeY6QfqVQonPyCwJrpJWfGw6LUBXgNBBcNTwDv
[riscv64] MI2a: maybe install (a providing target): libksba 1.6.4-alt1:sisyphus_riscv64+36515.400.1.1 at 1692111925
[riscv64] MI2a: target SELECTED: libksba 1.6.4-alt1:sisyphus_riscv64+36515.400.1.1 at 1692111925
[riscv64] MI2a: requesting to install libksba (unspec'd ver; inspect with Debug::pkgMark-shallow)
[riscv64] MI2a: marked for install (shallow): libksba
[riscv64] MI2a: satisfying Depends: libnpth.so.0()(64bit) >= set:jefTyCkyFgpxLHLbgCda1ZJWaiN0OrZbpushD4Ct8zfriiFcr6p5EqT6
[riscv64] MI2a: maybe install (a providing target): libnpth 1.6.0.20.g7e45b50-alt3:sisyphus_riscv64+8427.200.1.2 at 1633108234
[riscv64] MI2a: target SELECTED: libnpth 1.6.0.20.g7e45b50-alt3:sisyphus_riscv64+8427.200.1.2 at 1633108234
[riscv64] MI2a: requesting to install libnpth (unspec'd ver; inspect with Debug::pkgMark-shallow)
[riscv64] MI2a: marked for install (shallow): libnpth
[riscv64] MI2a: satisfying Depends: libusb-1.0.so.0()(64bit) >= set:kfVTRgguDvWjFX2kiQyBxcZbyX0fNqRv2rle7qFW8m22TdYYa99G1IIXZ2
[riscv64] MI2a: maybe install (a providing target): libusb 1.0.29-alt1:sisyphus_riscv64+90504.100.1.1 at 1753521123
[riscv64] MI2a: target SELECTED: libusb 1.0.29-alt1:sisyphus_riscv64+90504.100.1.1 at 1753521123
[riscv64] MI2a: requesting to install libusb (unspec'd ver; inspect with Debug::pkgMark-shallow)
[riscv64] MI2a: marked for install (shallow): libusb
[riscv64] MI2a: satisfying Depends: liblcms2.so.2()(64bit) >= set:miZ3ttuMXywUmwklzsHaE38WRi2mSeEO45
[riscv64] MI2a: maybe install (a providing target): liblcms2 2.19-alt1:sisyphus_riscv64+120569.100.1.1 at 1778214726
[riscv64] MI2a: target SELECTED: liblcms2 2.19-alt1:sisyphus_riscv64+120569.100.1.1 at 1778214726
[riscv64] MI2a: requesting to install liblcms2 (unspec'd ver; inspect with Debug::pkgMark-shallow)
[riscv64] MI2a: marked for install (shallow): liblcms2
[riscv64] MI2a: satisfying Depends: libnspr4.so()(64bit) >= set:mljVy1
[riscv64] MI2a: maybe install (a providing target): libnspr 1:4.35-alt1:sisyphus_riscv64+24811.100.1.1 at 1665406425
[riscv64] MI2a: target SELECTED: libnspr 1:4.35-alt1:sisyphus_riscv64+24811.100.1.1 at 1665406425
[riscv64] MI2a: requesting to install libnspr (unspec'd ver; inspect with Debug::pkgMark-shallow)
[riscv64] MI2a: marked for install (shallow): libnspr
[riscv64] MI2a: satisfying Depends: libnss3.so()(64bit) >= set:nh4szlPoI57iN4XQVI7VRrIQ6ADQvtrn8nUht4fo9LAqtAdtsP1ZkJqsNKa2HARm5Skd50imzZjlSWajrxpuXiY8352VJ9fvsajQKy0rqfyZmrJor7muh9oj4Y8sTZ9LV4WbNWxmOhgeyX79M6
[riscv64] MI2a: maybe install (a providing target): libnss 3.122-alt1:sisyphus_riscv64+116511.100.1.1 at 1774565792
[riscv64] MI2a: target SELECTED: libnss 3.122-alt1:sisyphus_riscv64+116511.100.1.1 at 1774565792
[riscv64] MI2a: requesting to install libnss (unspec'd ver; inspect with Debug::pkgMark-shallow)
[riscv64] MI2a: marked for install (shallow): libnss
[riscv64] MI2a: marked for install (shallow): graphviz
[riscv64] MI2a: satisfying Depends: libgraphviz = 12.2.1-alt2:sisyphus_riscv64+108018.100.1.1
[riscv64] MI2a: maybe install (a direct target): libgraphviz 12.2.1-alt2:sisyphus_riscv64+108018.100.1.1 at 1769333360
[riscv64] MI2a: target SELECTED: libgraphviz 12.2.1-alt2:sisyphus_riscv64+108018.100.1.1 at 1769333360
[riscv64] MI2a: requesting to install libgraphviz (unspec'd ver; inspect with Debug::pkgMark-shallow)
[riscv64] MI2a: marked for install (shallow): libgraphviz
[riscv64] MI2a: satisfying Depends: libLASi.so.2()(64bit) >= set:jgezwAeW8jFdsS0
[riscv64] MI2a: maybe install (a providing target): liblasi 1.1.3-alt3:sisyphus_riscv64+11318.100.1.1 at 1635818969
[riscv64] MI2a: target SELECTED: liblasi 1.1.3-alt3:sisyphus_riscv64+11318.100.1.1 at 1635818969
[riscv64] MI2a: requesting to install liblasi (unspec'd ver; inspect with Debug::pkgMark-shallow)
[riscv64] MI2a: marked for install (shallow): liblasi
[riscv64] MI2a: satisfying Depends: libgs.so.10()(64bit) >= set:qn8xN7vrFUdalhgHyGPYlZzoCUhf
[riscv64] MI2a: maybe install (a providing target): libgs 10.06.0-alt1:sisyphus_riscv64+96455.100.1.1 at 1759328376
[riscv64] MI2a: target SELECTED: libgs 10.06.0-alt1:sisyphus_riscv64+96455.100.1.1 at 1759328376
[riscv64] MI2a: requesting to install libgs (unspec'd ver; inspect with Debug::pkgMark-shallow)
[riscv64] MI2a: marked for install (shallow): libgs
[riscv64] MI2a: satisfying Depends: libcups.so.2()(64bit) >= set:nkyofC764OPfkeFEeoFg6
[riscv64] MI2a: maybe install (a providing target): libcups 2.4.18-alt2:sisyphus_riscv64+120407.100.1.1 at 1778197041
[riscv64] MI2a: target SELECTED: libcups 2.4.18-alt2:sisyphus_riscv64+120407.100.1.1 at 1778197041
[riscv64] MI2a: requesting to install libcups (unspec'd ver; inspect with Debug::pkgMark-shallow)
[riscv64] MI2a: marked for install (shallow): libcups
[riscv64] MI2a: satisfying Depends: libavahi-client.so.3()(64bit) >= set:jfA3BZHwMrmi1ycn68JmS1
[riscv64] MI2a: maybe install (a providing target): libavahi 0.8-alt5:sisyphus_riscv64+70410.100.1.1 at 1737408836
[riscv64] MI2a: target SELECTED: libavahi 0.8-alt5:sisyphus_riscv64+70410.100.1.1 at 1737408836
[riscv64] MI2a: requesting to install libavahi (unspec'd ver; inspect with Debug::pkgMark-shallow)
[riscv64] MI2a: marked for install (shallow): libavahi
[riscv64] MI2a: satisfying Depends: libdbus-1.so.3()(64bit) >= set:nh6lX7Ch1wT2tnoGAavkoLIaOMlFPWDh2IEzDczREsNGvcJ2BIMVtJOyc4lBdf4zY4GjRLnRfkz1gIEZ8jmTn6D8DxpXZEi5nIzL0GgM7BgUUTXmsBYUJYVMhiaqZ3t2
[riscv64] MI2a: maybe install (a providing target): libdbus 1.16.2-alt1:sisyphus_riscv64+74775.100.1.1 at 1740875412
[riscv64] MI2a: target SELECTED: libdbus 1.16.2-alt1:sisyphus_riscv64+74775.100.1.1 at 1740875412
[riscv64] MI2a: requesting to install libdbus (unspec'd ver; inspect with Debug::pkgMark-shallow)
[riscv64] MI2a: marked for install (shallow): libdbus
[riscv64] MI2a: satisfying Depends: libsystemd.so.0()(64bit) >= set:nlK0Q6n66
[riscv64] MI2a: maybe install (a providing target): libsystemd 1:258.5-alt1:sisyphus_riscv64+112565.100.1.2 at 1772470306
[riscv64] MI2a: target SELECTED: libsystemd 1:258.5-alt1:sisyphus_riscv64+112565.100.1.2 at 1772470306
[riscv64] MI2a: requesting to install libsystemd (unspec'd ver; inspect with Debug::pkgMark-shallow)
[riscv64] MI2a: marked for install (shallow): libsystemd
[riscv64] MI2a: satisfying Depends: libpaper.so.2()(64bit) >= set:ifZF4Qrs5jQ7
[riscv64] MI2a: maybe install (a providing target): libpaper2 2:2.2.7-alt1:sisyphus_riscv64+113608.100.1.1 at 1773059688
[riscv64] MI2a: target SELECTED: libpaper2 2:2.2.7-alt1:sisyphus_riscv64+113608.100.1.1 at 1773059688
[riscv64] MI2a: requesting to install libpaper2 (unspec'd ver; inspect with Debug::pkgMark-shallow)
[riscv64] MI2a: marked for install (shallow): libpaper2
[riscv64] MI2a: satisfying Depends: libgts-0.7.so.5()(64bit) >= set:mhxj2zgZHl55QfIDRHPZbhIQlS60gl1BrP9oP7GRC9R7PDrFjEBrr9ucF4ZqKnhiEqb81
[riscv64] MI2a: maybe install (a providing target): libgts 0.7.6-alt2.drc20130205.1:sisyphus_riscv64+49243.100.1.1 at 1716544099
[riscv64] MI2a: target SELECTED: libgts 0.7.6-alt2.drc20130205.1:sisyphus_riscv64+49243.100.1.1 at 1716544099
[riscv64] MI2a: requesting to install libgts (unspec'd ver; inspect with Debug::pkgMark-shallow)
[riscv64] MI2a: marked for install (shallow): libgts
[riscv64] MI2a: marked for install (shallow): python3-module-breathe
[riscv64] MI2a: satisfying Depends: python3(docutils) < 0
[riscv64] MI2a: maybe install (a providing target): python3-module-docutils 0.22.4-alt1.1:sisyphus_riscv64+116938.400.1.1 at 1774856059
[riscv64] MI2a: target SELECTED: python3-module-docutils 0.22.4-alt1.1:sisyphus_riscv64+116938.400.1.1 at 1774856059
[riscv64] MI2a: requesting to install python3-module-docutils (unspec'd ver; inspect with Debug::pkgMark-shallow)
[riscv64] MI2a: marked for install (shallow): python3-module-docutils
[riscv64] MI2a: satisfying Depends: python3(sphinx) < 0
[riscv64] MI2a: maybe install (a providing target): python3-module-sphinx 1:8.2.3-alt1:sisyphus_riscv64+109702.100.1.1 at 1770467036
[riscv64] MI2a: target SELECTED: python3-module-sphinx 1:8.2.3-alt1:sisyphus_riscv64+109702.100.1.1 at 1770467036
[riscv64] MI2a: requesting to install python3-module-sphinx (unspec'd ver; inspect with Debug::pkgMark-shallow)
[riscv64] MI2a: marked for install (shallow): python3-module-sphinx
[riscv64] MI2a: satisfying Depends: python3(sphinxcontrib.applehelp) (NULL)
[riscv64] MI2a: maybe install (a providing target): python3-module-sphinxcontrib-applehelp 2.0.0-alt1:sisyphus_riscv64+51654.100.1.1 at 1722324815
[riscv64] MI2a: target SELECTED: python3-module-sphinxcontrib-applehelp 2.0.0-alt1:sisyphus_riscv64+51654.100.1.1 at 1722324815
[riscv64] MI2a: requesting to install python3-module-sphinxcontrib-applehelp (unspec'd ver; inspect with Debug::pkgMark-shallow)
[riscv64] MI2a: marked for install (shallow): python3-module-sphinxcontrib-applehelp
[riscv64] MI2a: satisfying Depends: python3(sphinxcontrib.devhelp) (NULL)
[riscv64] MI2a: maybe install (a providing target): python3-module-sphinxcontrib-devhelp 2.0.0-alt1:sisyphus_riscv64+51654.200.1.1 at 1722324955
[riscv64] MI2a: target SELECTED: python3-module-sphinxcontrib-devhelp 2.0.0-alt1:sisyphus_riscv64+51654.200.1.1 at 1722324955
[riscv64] MI2a: requesting to install python3-module-sphinxcontrib-devhelp (unspec'd ver; inspect with Debug::pkgMark-shallow)
[riscv64] MI2a: marked for install (shallow): python3-module-sphinxcontrib-devhelp
[riscv64] MI2a: satisfying Depends: python3(sphinxcontrib.jquery) (NULL)
[riscv64] MI2a: maybe install (a providing target): python3-module-sphinxcontrib-jquery 4.1-alt3:sisyphus_riscv64+43706.100.1.3 at 1709088073
[riscv64] MI2a: target SELECTED: python3-module-sphinxcontrib-jquery 4.1-alt3:sisyphus_riscv64+43706.100.1.3 at 1709088073
[riscv64] MI2a: requesting to install python3-module-sphinxcontrib-jquery (unspec'd ver; inspect with Debug::pkgMark-shallow)
[riscv64] MI2a: marked for install (shallow): python3-module-sphinxcontrib-jquery
[riscv64] MI2a: satisfying Depends: python3(sphinxcontrib.jsmath) (NULL)
[riscv64] MI2a: maybe install (a providing target): python3-module-sphinxcontrib-jsmath 1.0.1-alt3:sisyphus_riscv64+85535.100.1.1 at 1749200679
[riscv64] MI2a: target SELECTED: python3-module-sphinxcontrib-jsmath 1.0.1-alt3:sisyphus_riscv64+85535.100.1.1 at 1749200679
[riscv64] MI2a: requesting to install python3-module-sphinxcontrib-jsmath (unspec'd ver; inspect with Debug::pkgMark-shallow)
[riscv64] MI2a: marked for install (shallow): python3-module-sphinxcontrib-jsmath
[riscv64] MI2a: satisfying Depends: python3(sphinxcontrib.htmlhelp) (NULL)
[riscv64] MI2a: maybe install (a providing target): python3-module-sphinxcontrib-htmlhelp 2.1.0-alt1.1:sisyphus_riscv64+116966.600.1.1 at 1774888080
[riscv64] MI2a: target SELECTED: python3-module-sphinxcontrib-htmlhelp 2.1.0-alt1.1:sisyphus_riscv64+116966.600.1.1 at 1774888080
[riscv64] MI2a: requesting to install python3-module-sphinxcontrib-htmlhelp (unspec'd ver; inspect with Debug::pkgMark-shallow)
[riscv64] MI2a: marked for install (shallow): python3-module-sphinxcontrib-htmlhelp
[riscv64] MI2a: satisfying Depends: python3(sphinxcontrib.serializinghtml) (NULL)
[riscv64] MI2a: maybe install (a providing target): python3-module-sphinxcontrib-serializinghtml 2.0.0-alt1:sisyphus_riscv64+55316.100.1.1 at 1730300455
[riscv64] MI2a: target SELECTED: python3-module-sphinxcontrib-serializinghtml 2.0.0-alt1:sisyphus_riscv64+55316.100.1.1 at 1730300455
[riscv64] MI2a: requesting to install python3-module-sphinxcontrib-serializinghtml (unspec'd ver; inspect with Debug::pkgMark-shallow)
[riscv64] MI2a: marked for install (shallow): python3-module-sphinxcontrib-serializinghtml
[riscv64] MI2a: satisfying Depends: python3(sphinxcontrib.qthelp) (NULL)
[riscv64] MI2a: maybe install (a providing target): python3-module-sphinxcontrib-qthelp 2.0.0-alt1:sisyphus_riscv64+51654.300.1.1 at 1722325094
[riscv64] MI2a: target SELECTED: python3-module-sphinxcontrib-qthelp 2.0.0-alt1:sisyphus_riscv64+51654.300.1.1 at 1722325094
[riscv64] MI2a: requesting to install python3-module-sphinxcontrib-qthelp (unspec'd ver; inspect with Debug::pkgMark-shallow)
[riscv64] MI2a: marked for install (shallow): python3-module-sphinxcontrib-qthelp
[riscv64] MI2a: satisfying Depends: python3(babel) (NULL)
[riscv64] MI2a: maybe install (a providing target): python3-module-babel 1:2.17.0-alt1:sisyphus_riscv64+82353.100.1.1 at 1746638535
[riscv64] MI2a: target SELECTED: python3-module-babel 1:2.17.0-alt1:sisyphus_riscv64+82353.100.1.1 at 1746638535
[riscv64] MI2a: requesting to install python3-module-babel (unspec'd ver; inspect with Debug::pkgMark-shallow)
[riscv64] MI2a: marked for install (shallow): python3-module-babel
[riscv64] MI2a: satisfying Depends: python3(alabaster) (NULL)
[riscv64] MI2a: maybe install (a providing target): python3-module-alabaster 0.7.16-alt1:sisyphus_riscv64+49569.100.1.1 at 1716933453
[riscv64] MI2a: target SELECTED: python3-module-alabaster 0.7.16-alt1:sisyphus_riscv64+49569.100.1.1 at 1716933453
[riscv64] MI2a: requesting to install python3-module-alabaster (unspec'd ver; inspect with Debug::pkgMark-shallow)
[riscv64] MI2a: marked for install (shallow): python3-module-alabaster
[riscv64] MI2a: satisfying Depends: python3(defusedxml) (NULL)
[riscv64] MI2a: maybe install (a providing target): python3-module-defusedxml 0.7.1-alt2:sisyphus_riscv64+97275.100.1.1 at 1761164143
[riscv64] MI2a: target SELECTED: python3-module-defusedxml 0.7.1-alt2:sisyphus_riscv64+97275.100.1.1 at 1761164143
[riscv64] MI2a: requesting to install python3-module-defusedxml (unspec'd ver; inspect with Debug::pkgMark-shallow)
[riscv64] MI2a: marked for install (shallow): python3-module-defusedxml
[riscv64] MI2a: satisfying Depends: python3(lxml) < 0
[riscv64] MI2a: maybe install (a providing target): python3-module-lxml 6.0.2-alt1:sisyphus_riscv64+107637.100.1.1 at 1769149480
[riscv64] MI2a: target SELECTED: python3-module-lxml 6.0.2-alt1:sisyphus_riscv64+107637.100.1.1 at 1769149480
[riscv64] MI2a: requesting to install python3-module-lxml (unspec'd ver; inspect with Debug::pkgMark-shallow)
[riscv64] MI2a: marked for install (shallow): python3-module-lxml
[riscv64] MI2a: satisfying Depends: python3-module-cssselect (NULL)
[riscv64] MI2a: maybe install (a direct target): python3-module-cssselect 1.4.0-alt1.1:sisyphus_riscv64+116970.200.1.1 at 1774891857
[riscv64] MI2a: target SELECTED: python3-module-cssselect 1.4.0-alt1.1:sisyphus_riscv64+116970.200.1.1 at 1774891857
[riscv64] MI2a: requesting to install python3-module-cssselect (unspec'd ver; inspect with Debug::pkgMark-shallow)
[riscv64] MI2a: marked for install (shallow): python3-module-cssselect
[riscv64] MI2a: satisfying Depends: libexslt.so.0()(64bit) >= set:ifFYpbWiXMSnz0
[riscv64] MI2a: maybe install (a providing target): libxslt 1.1.43-alt1:sisyphus_riscv64+98697.100.1.1 at 1761621654
[riscv64] MI2a: target SELECTED: libxslt 1.1.43-alt1:sisyphus_riscv64+98697.100.1.1 at 1761621654
[riscv64] MI2a: requesting to install libxslt (unspec'd ver; inspect with Debug::pkgMark-shallow)
[riscv64] MI2a: marked for install (shallow): libxslt
[riscv64] MI2a: satisfying Depends: python3(html5lib) < 0
[riscv64] MI2a: maybe install (a providing target): python3-module-html5lib 1:1.1-alt1:sisyphus_riscv64+9885.100.2.1 at 1635066927
[riscv64] MI2a: target SELECTED: python3-module-html5lib 1:1.1-alt1:sisyphus_riscv64+9885.100.2.1 at 1635066927
[riscv64] MI2a: requesting to install python3-module-html5lib (unspec'd ver; inspect with Debug::pkgMark-shallow)
[riscv64] MI2a: marked for install (shallow): python3-module-html5lib
[riscv64] MI2a: satisfying Depends: python3(genshi.core) < 0
[riscv64] MI2a: maybe install (a providing target): python3-module-genshi 0.7.10-alt1:sisyphus_riscv64+108145.100.1.1 at 1769450278
[riscv64] MI2a: target SELECTED: python3-module-genshi 0.7.10-alt1:sisyphus_riscv64+108145.100.1.1 at 1769450278
[riscv64] MI2a: requesting to install python3-module-genshi (unspec'd ver; inspect with Debug::pkgMark-shallow)
[riscv64] MI2a: marked for install (shallow): python3-module-genshi
[riscv64] MI2a: satisfying Depends: python3(six) < 0
[riscv64] MI2a: maybe install (a providing target): python3-module-six 1.17.0-alt1.1:sisyphus_riscv64+72388.100.1.1 at 1738957031
[riscv64] MI2a: target SELECTED: python3-module-six 1.17.0-alt1.1:sisyphus_riscv64+72388.100.1.1 at 1738957031
[riscv64] MI2a: requesting to install python3-module-six (unspec'd ver; inspect with Debug::pkgMark-shallow)
[riscv64] MI2a: marked for install (shallow): python3-module-six
[riscv64] MI2a: satisfying Depends: python3(webencodings) < 0
[riscv64] MI2a: maybe install (a providing target): python3-module-webencodings 0.5.1-alt3:sisyphus_riscv64+54276.100.1.1 at 1728411577
[riscv64] MI2a: target SELECTED: python3-module-webencodings 0.5.1-alt3:sisyphus_riscv64+54276.100.1.1 at 1728411577
[riscv64] MI2a: requesting to install python3-module-webencodings (unspec'd ver; inspect with Debug::pkgMark-shallow)
[riscv64] MI2a: marked for install (shallow): python3-module-webencodings
[riscv64] MI2a: satisfying Depends: /usr/share/python-sphinx/objects.inv (NULL)
[riscv64] MI2a: maybe install (a providing target): python-sphinx-objects.inv 1:2.3.15.20251025-alt1:sisyphus_riscv64+98728.100.1.1 at 1761624538
[riscv64] MI2a: target SELECTED: python-sphinx-objects.inv 1:2.3.15.20251025-alt1:sisyphus_riscv64+98728.100.1.1 at 1761624538
[riscv64] MI2a: requesting to install python-sphinx-objects.inv (unspec'd ver; inspect with Debug::pkgMark-shallow)
[riscv64] MI2a: marked for install (shallow): python-sphinx-objects.inv
[riscv64] MI2a: satisfying Depends: python3(imagesize) < 0
[riscv64] MI2a: maybe install (a providing target): python3-module-imagesize 2.0.0-alt1:sisyphus_riscv64+116322.100.1.1 at 1774494560
[riscv64] MI2a: target SELECTED: python3-module-imagesize 2.0.0-alt1:sisyphus_riscv64+116322.100.1.1 at 1774494560
[riscv64] MI2a: requesting to install python3-module-imagesize (unspec'd ver; inspect with Debug::pkgMark-shallow)
[riscv64] MI2a: marked for install (shallow): python3-module-imagesize
[riscv64] MI2a: satisfying Depends: python3(jinja2) < 0
[riscv64] MI2a: maybe install (a providing target): python3-module-jinja2 3.1.6-alt2:sisyphus_riscv64+117241.100.1.3 at 1774966466
[riscv64] MI2a: target SELECTED: python3-module-jinja2 3.1.6-alt2:sisyphus_riscv64+117241.100.1.3 at 1774966466
[riscv64] MI2a: requesting to install python3-module-jinja2 (unspec'd ver; inspect with Debug::pkgMark-shallow)
[riscv64] MI2a: marked for install (shallow): python3-module-jinja2
[riscv64] MI2a: satisfying Depends: python3-module-markupsafe (NULL)
[riscv64] MI2a: maybe install (a direct target): python3-module-markupsafe 1:3.0.3-alt1:sisyphus_riscv64+97041.100.1.1 at 1761039734
[riscv64] MI2a: target SELECTED: python3-module-markupsafe 1:3.0.3-alt1:sisyphus_riscv64+97041.100.1.1 at 1761039734
[riscv64] MI2a: requesting to install python3-module-markupsafe (unspec'd ver; inspect with Debug::pkgMark-shallow)
[riscv64] MI2a: marked for install (shallow): python3-module-markupsafe
[riscv64] MI2a: satisfying Depends: python3(requests) < 0
[riscv64] MI2a: maybe install (a providing target): python3-module-requests 2.33.1-alt1:sisyphus_riscv64+117526.100.1.1 at 1775145094
[riscv64] MI2a: target SELECTED: python3-module-requests 2.33.1-alt1:sisyphus_riscv64+117526.100.1.1 at 1775145094
[riscv64] MI2a: requesting to install python3-module-requests (unspec'd ver; inspect with Debug::pkgMark-shallow)
[riscv64] MI2a: marked for install (shallow): python3-module-requests
[riscv64] MI2a: satisfying Depends: python3-module-charset-normalizer (NULL)
[riscv64] MI2a: maybe install (a direct target): python3-module-charset-normalizer 3.4.7-alt1:sisyphus_riscv64+118447.100.1.1 at 1775820638
[riscv64] MI2a: target SELECTED: python3-module-charset-normalizer 3.4.7-alt1:sisyphus_riscv64+118447.100.1.1 at 1775820638
[riscv64] MI2a: requesting to install python3-module-charset-normalizer (unspec'd ver; inspect with Debug::pkgMark-shallow)
[riscv64] MI2a: marked for install (shallow): python3-module-charset-normalizer
[riscv64] MI2a: satisfying Depends: python3-module-idna (NULL)
[riscv64] MI2a: maybe install (a direct target): python3-module-idna 3.11-alt1:sisyphus_riscv64+97379.100.1.1 at 1761191820
[riscv64] MI2a: target SELECTED: python3-module-idna 3.11-alt1:sisyphus_riscv64+97379.100.1.1 at 1761191820
[riscv64] MI2a: requesting to install python3-module-idna (unspec'd ver; inspect with Debug::pkgMark-shallow)
[riscv64] MI2a: marked for install (shallow): python3-module-idna
[riscv64] MI2a: satisfying Depends: python3-module-urllib3 (NULL)
[riscv64] MI2a: maybe install (a direct target): python3-module-urllib3 2:2.6.3-alt1:sisyphus_riscv64+106725.100.1.1 at 1768396236
[riscv64] MI2a: target SELECTED: python3-module-urllib3 2:2.6.3-alt1:sisyphus_riscv64+106725.100.1.1 at 1768396236
[riscv64] MI2a: requesting to install python3-module-urllib3 (unspec'd ver; inspect with Debug::pkgMark-shallow)
[riscv64] MI2a: marked for install (shallow): python3-module-urllib3
[riscv64] MI2a: satisfying Depends: python3(roman_numerals) < 0
[riscv64] MI2a: maybe install (a providing target): python3-module-roman_numerals 3.1.0-alt2:sisyphus_riscv64+102818.100.1.1 at 1764891894
[riscv64] MI2a: target SELECTED: python3-module-roman_numerals 3.1.0-alt2:sisyphus_riscv64+102818.100.1.1 at 1764891894
[riscv64] MI2a: requesting to install python3-module-roman_numerals (unspec'd ver; inspect with Debug::pkgMark-shallow)
[riscv64] MI2a: marked for install (shallow): python3-module-roman_numerals
[riscv64] MI2a: satisfying Depends: python3(snowballstemmer) < 0
[riscv64] MI2a: maybe install (a providing target): python3-module-snowballstemmer 2.2.0-alt1:sisyphus_riscv64+32066.100.1.1 at 1683162857
[riscv64] MI2a: target SELECTED: python3-module-snowballstemmer 2.2.0-alt1:sisyphus_riscv64+32066.100.1.1 at 1683162857
[riscv64] MI2a: requesting to install python3-module-snowballstemmer (unspec'd ver; inspect with Debug::pkgMark-shallow)
[riscv64] MI2a: marked for install (shallow): python3-module-snowballstemmer
[riscv64] MI2a: satisfying Depends: python3-module-sphinx-sphinx-build-symlink = 1:8.2.3-alt1:sisyphus_riscv64+109702.100.1.1
[riscv64] MI2a: maybe install (a direct target): python3-module-sphinx-sphinx-build-symlink 1:8.2.3-alt1:sisyphus_riscv64+109702.100.1.1 at 1770467036
[riscv64] MI2a: target SELECTED: python3-module-sphinx-sphinx-build-symlink 1:8.2.3-alt1:sisyphus_riscv64+109702.100.1.1 at 1770467036
[riscv64] MI2a: requesting to install python3-module-sphinx-sphinx-build-symlink (unspec'd ver; inspect with Debug::pkgMark-shallow)
[riscv64] MI2a: marked for install (shallow): python3-module-sphinx-sphinx-build-symlink
[riscv64] MI2a: marked for install (shallow): python3-module-fsspec
[riscv64] MI2a: satisfying Depends: python3(aiohttp) < 0
[riscv64] MI2a: maybe install (a providing target): python3-module-aiohttp 3.13.5-alt1:sisyphus_riscv64+117556.100.1.1 at 1775152241
[riscv64] MI2a: target SELECTED: python3-module-aiohttp 3.13.5-alt1:sisyphus_riscv64+117556.100.1.1 at 1775152241
[riscv64] MI2a: requesting to install python3-module-aiohttp (unspec'd ver; inspect with Debug::pkgMark-shallow)
[riscv64] MI2a: marked for install (shallow): python3-module-aiohttp
[riscv64] MI2a: satisfying Depends: python3-module-aiohappyeyeballs (NULL)
[riscv64] MI2a: maybe install (a direct target): python3-module-aiohappyeyeballs 2.6.1-alt2:sisyphus_riscv64+94949.100.1.1 at 1757689137
[riscv64] MI2a: target SELECTED: python3-module-aiohappyeyeballs 2.6.1-alt2:sisyphus_riscv64+94949.100.1.1 at 1757689137
[riscv64] MI2a: requesting to install python3-module-aiohappyeyeballs (unspec'd ver; inspect with Debug::pkgMark-shallow)
[riscv64] MI2a: marked for install (shallow): python3-module-aiohappyeyeballs
[riscv64] MI2a: satisfying Depends: python3-module-aiosignal (NULL)
[riscv64] MI2a: maybe install (a direct target): python3-module-aiosignal 1.4.0-alt1:sisyphus_riscv64+89342.100.1.1 at 1752507296
[riscv64] MI2a: target SELECTED: python3-module-aiosignal 1.4.0-alt1:sisyphus_riscv64+89342.100.1.1 at 1752507296
[riscv64] MI2a: requesting to install python3-module-aiosignal (unspec'd ver; inspect with Debug::pkgMark-shallow)
[riscv64] MI2a: marked for install (shallow): python3-module-aiosignal
[riscv64] MI2a: satisfying Depends: python3-module-frozenlist (NULL)
[riscv64] MI2a: maybe install (a direct target): python3-module-frozenlist 1.8.0-alt1:sisyphus_riscv64+97725.100.1.1 at 1761365092
[riscv64] MI2a: target SELECTED: python3-module-frozenlist 1.8.0-alt1:sisyphus_riscv64+97725.100.1.1 at 1761365092
[riscv64] MI2a: requesting to install python3-module-frozenlist (unspec'd ver; inspect with Debug::pkgMark-shallow)
[riscv64] MI2a: marked for install (shallow): python3-module-frozenlist
[riscv64] MI2a: satisfying Depends: python3-module-attrs (NULL)
[riscv64] MI2a: maybe install (a direct target): python3-module-attrs 26.1.0-alt1:sisyphus_riscv64+118129.100.1.1 at 1775598784
[riscv64] MI2a: target SELECTED: python3-module-attrs 26.1.0-alt1:sisyphus_riscv64+118129.100.1.1 at 1775598784
[riscv64] MI2a: requesting to install python3-module-attrs (unspec'd ver; inspect with Debug::pkgMark-shallow)
[riscv64] MI2a: marked for install (shallow): python3-module-attrs
[riscv64] MI2a: satisfying Depends: python3-module-multidict (NULL)
[riscv64] MI2a: maybe install (a direct target): python3-module-multidict 6.7.1-alt1:sisyphus_riscv64+108327.100.1.1 at 1769506118
[riscv64] MI2a: target SELECTED: python3-module-multidict 6.7.1-alt1:sisyphus_riscv64+108327.100.1.1 at 1769506118
[riscv64] MI2a: requesting to install python3-module-multidict (unspec'd ver; inspect with Debug::pkgMark-shallow)
[riscv64] MI2a: marked for install (shallow): python3-module-multidict
[riscv64] MI2a: satisfying Depends: python3-module-propcache (NULL)
[riscv64] MI2a: maybe install (a direct target): python3-module-propcache 0.4.1-alt2:sisyphus_riscv64+117155.100.1.1 at 1774931491
[riscv64] MI2a: target SELECTED: python3-module-propcache 0.4.1-alt2:sisyphus_riscv64+117155.100.1.1 at 1774931491
[riscv64] MI2a: requesting to install python3-module-propcache (unspec'd ver; inspect with Debug::pkgMark-shallow)
[riscv64] MI2a: marked for install (shallow): python3-module-propcache
[riscv64] MI2a: satisfying Depends: python3-module-yarl (NULL)
[riscv64] MI2a: maybe install (a direct target): python3-module-yarl 1.23.0-alt1:sisyphus_riscv64+112723.100.1.1 at 1772546761
[riscv64] MI2a: target SELECTED: python3-module-yarl 1.23.0-alt1:sisyphus_riscv64+112723.100.1.1 at 1772546761
[riscv64] MI2a: requesting to install python3-module-yarl (unspec'd ver; inspect with Debug::pkgMark-shallow)
[riscv64] MI2a: marked for install (shallow): python3-module-yarl
[riscv64] MI2a: satisfying Depends: libllhttp.so.9.3()(64bit) >= set:kgvrwoAugAMUKZCxnRSfFd8lKpmK2hxe
[riscv64] MI2a: maybe install (a providing target): libllhttp 9.3.1-alt1:sisyphus_riscv64+110806.100.1.1 at 1771254589
[riscv64] MI2a: target SELECTED: libllhttp 9.3.1-alt1:sisyphus_riscv64+110806.100.1.1 at 1771254589
[riscv64] MI2a: requesting to install libllhttp (unspec'd ver; inspect with Debug::pkgMark-shallow)
[riscv64] MI2a: marked for install (shallow): libllhttp
[riscv64] MI2a: satisfying Depends: python3(dask) < 0
[riscv64] MI2a: maybe install (a providing target): python3-module-dask 2026.1.2-alt1:sisyphus_riscv64+114126.100.1.1 at 1773217251
[riscv64] MI2a: target SELECTED: python3-module-dask 2026.1.2-alt1:sisyphus_riscv64+114126.100.1.1 at 1773217251
[riscv64] MI2a: requesting to install python3-module-dask (unspec'd ver; inspect with Debug::pkgMark-shallow)
[riscv64] MI2a: marked for install (shallow): python3-module-dask
[riscv64] MI2a: satisfying Depends: python3(cloudpickle) < 0
[riscv64] MI2a: maybe install (a providing target): python3-module-cloudpickle 3.1.2-alt1:sisyphus_riscv64+103758.100.1.1 at 1765483790
[riscv64] MI2a: target SELECTED: python3-module-cloudpickle 3.1.2-alt1:sisyphus_riscv64+103758.100.1.1 at 1765483790
[riscv64] MI2a: requesting to install python3-module-cloudpickle (unspec'd ver; inspect with Debug::pkgMark-shallow)
[riscv64] MI2a: marked for install (shallow): python3-module-cloudpickle
[riscv64] MI2a: satisfying Depends: python3(pandas) < 0
[riscv64] MI2a: maybe install (a providing target): python3-module-pandas 2.3.3-alt1:sisyphus_riscv64+97959.100.1.1 at 1761443514
[riscv64] MI2a: target SELECTED: python3-module-pandas 2.3.3-alt1:sisyphus_riscv64+97959.100.1.1 at 1761443514
[riscv64] MI2a: requesting to install python3-module-pandas (unspec'd ver; inspect with Debug::pkgMark-shallow)
[riscv64] MI2a: marked for install (shallow): python3-module-pandas
[riscv64] MI2a: satisfying Depends: python3(pytz) < 0
[riscv64] MI2a: maybe install (a providing target): python3-module-pytz 1:2026.1.post1-alt1.1:sisyphus_riscv64+116937.100.1.2 at 1774856124
[riscv64] MI2a: target SELECTED: python3-module-pytz 1:2026.1.post1-alt1.1:sisyphus_riscv64+116937.100.1.2 at 1774856124
[riscv64] MI2a: requesting to install python3-module-pytz (unspec'd ver; inspect with Debug::pkgMark-shallow)
[riscv64] MI2a: marked for install (shallow): python3-module-pytz
[riscv64] MI2a: satisfying Depends: python3(dateutil) < 0
[riscv64] MI2a: maybe install (a providing target): python3-module-dateutil 2.9.0.post0-alt1:sisyphus_riscv64+76718.100.2.1 at 1742460149
[riscv64] MI2a: target SELECTED: python3-module-dateutil 2.9.0.post0-alt1:sisyphus_riscv64+76718.100.2.1 at 1742460149
[riscv64] MI2a: requesting to install python3-module-dateutil (unspec'd ver; inspect with Debug::pkgMark-shallow)
[riscv64] MI2a: marked for install (shallow): python3-module-dateutil
[riscv64] MI2a: satisfying Depends: python3(sqlalchemy) < 0
[riscv64] MI2a: maybe install (a providing target): python3-module-sqlalchemy 2.0.49-alt1:sisyphus_riscv64+118018.100.1.1 at 1775566982
[riscv64] MI2a: target SELECTED: python3-module-sqlalchemy 2.0.49-alt1:sisyphus_riscv64+118018.100.1.1 at 1775566982
[riscv64] MI2a: requesting to install python3-module-sqlalchemy (unspec'd ver; inspect with Debug::pkgMark-shallow)
[riscv64] MI2a: marked for install (shallow): python3-module-sqlalchemy
[riscv64] MI2a: satisfying Depends: python3(numexpr) < 0
[riscv64] MI2a: maybe install (a providing target): python3-module-numexpr 1:2.14.1-alt1:sisyphus_riscv64+97482.100.1.1 at 1761263658
[riscv64] MI2a: target SELECTED: python3-module-numexpr 1:2.14.1-alt1:sisyphus_riscv64+97482.100.1.1 at 1761263658
[riscv64] MI2a: requesting to install python3-module-numexpr (unspec'd ver; inspect with Debug::pkgMark-shallow)
[riscv64] MI2a: marked for install (shallow): python3-module-numexpr
[riscv64] MI2a: satisfying Depends: python3(scipy) < 0
[riscv64] MI2a: maybe install (a providing target): python3-module-scipy 1.17.1-alt1:sisyphus_riscv64+112460.100.1.1 at 1772426268
[riscv64] MI2a: target SELECTED: python3-module-scipy 1.17.1-alt1:sisyphus_riscv64+112460.100.1.1 at 1772426268
[riscv64] MI2a: requesting to install python3-module-scipy (unspec'd ver; inspect with Debug::pkgMark-shallow)
[riscv64] MI2a: marked for install (shallow): python3-module-scipy
[riscv64] MI2a: satisfying Depends: libflexiblas.so.3()(64bit) >= set:shJggdd49NZb1cj7NBiXcHD5VnilKS5KaDQd4cnd7ryyzdxBPsVJeG3g5LAMMZrE9gb99fsaxg8BUfxq4J7eSpRfZqtMcf0ZA4hA0l8Ngw8C9gxwX5NhNtZb2tVy5RqVoTXbyt516C5YZuI684PSZKU44E5kMS9MyZFCBeGJutZ1AbbUxCv2vdtpJutxljbEsJLIThF6bjKvZHvxVMj9l1jNWre7d6qat2bjgeSKqtHTPII4t1wRjgbpLawar4VQkkfJgclEGuvbgQ1n7b0bB6r6gsvUoZjECT1oFvZ4wHnSkVuClcHTSbbprgSChWmt0ANZexg3IPTyhqc31eJN75TJlEp6FqJbRRp5ztmWk4GQEbfgOacvBF7eVX01unun7WRFlfqRgxYgx49Fu1j2f3kfbiZAYoMTfrnkL4yZnSjZvXX62g4AieqgZEPIEEx2YOtqfM1QeTZ5KURloRCM5qDZtV795XtsZaX6zQoJv2vHrGnPwW17ariyuFQXT9wsAnHytWF8asZiuLeZ4ggOuIOEaq0S2yUFa93dDcbjsyBP0xbZdYSZnKRPZjyZ5cRSHdBJZC6jl9yqN4PW81isUIPiRQi9Q3ZFZc3x0zg9yddcbJeFaFa0lILZ2IQlTfBg2hd7e8N5lK7FZ77TMcuAJEpZlk2bCZhrMQZhQ4cvnZqWOtPCHgu6yBpkC7s6BC3Tq3xuqi0ygGEdAf8PTMNdotblZLvA6EOqdzebZ0UkAibIWR6sdyjYzsUEpbOqLU4FRXSUTZ6lddPpZ1nUHBrJbeMoXYfMUGOCAZw4UOK8Z1Z0B0GhM7W8ysRY8W3QLxfJMGB4LnmB9UF774xZpQoJtxHZBmemEOff4NOsYM5uC8lDG3s0mNqMHLd6s1qCwRw2aTjfdVTWDg42GH9hwHcuD2
TjFeMraPgHGAVAXCLvL13O2DiVvsTe7892jbrubavnleKZap1EmxI9cZcFODvjJ7VagOyzg4cRP8eAw35mvKRT8CdVZEk3J0mmVKfRZlOjbRPA4GESQcTVJ6KciWZ7yL5UqvL0MVbSAhpGynwWkMD1taB0AL67AorP0QZiOobKAhm8ehES3hIKJMeJVgmtxuiZ7wqIgZ5o7ZbHfwudKMI2a: maybe install (a providing target): libflexiblas.3 3.5.0-alt1:sisyphus_riscv64+102091.100.1.1 at 1764307940
[riscv64] MI2a: target SELECTED: libflexiblas.3 3.5.0-alt1:sisyphus_riscv64+102091.100.1.1 at 1764307940
[riscv64] MI2a: requesting to install libflexiblas.3 (unspec'd ver; inspect with Debug::pkgMark-shallow)
[riscv64] MI2a: marked for install (shallow): libflexiblas.3
[riscv64] MI2a: satisfying Depends: flexiblas-netlib = 3.5.0-alt1:sisyphus_riscv64+102091.100.1.1
[riscv64] MI2a: maybe install (a direct target): flexiblas-netlib 3.5.0-alt1:sisyphus_riscv64+102091.100.1.1 at 1764307940
[riscv64] MI2a: target SELECTED: flexiblas-netlib 3.5.0-alt1:sisyphus_riscv64+102091.100.1.1 at 1764307940
[riscv64] MI2a: requesting to install flexiblas-netlib (unspec'd ver; inspect with Debug::pkgMark-shallow)
[riscv64] MI2a: marked for install (shallow): flexiblas-netlib
[riscv64] MI2a: satisfying Depends: flexiblas = 3.5.0-alt1:sisyphus_riscv64+102091.100.1.1
[riscv64] MI2a: maybe install (a direct target): flexiblas 3.5.0-alt1:sisyphus_riscv64+102091.100.1.1 at 1764307940
[riscv64] MI2a: target SELECTED: flexiblas 3.5.0-alt1:sisyphus_riscv64+102091.100.1.1 at 1764307940
[riscv64] MI2a: requesting to install flexiblas (unspec'd ver; inspect with Debug::pkgMark-shallow)
[riscv64] MI2a: marked for install (shallow): flexiblas
[riscv64] MI2a: satisfying Depends: python3(mpmath) < 0
[riscv64] MI2a: maybe install (a providing target): python3-module-mpmath 1.3.0-alt1:sisyphus_riscv64+79226.100.1.1 at 1744053854
[riscv64] MI2a: target SELECTED: python3-module-mpmath 1.3.0-alt1:sisyphus_riscv64+79226.100.1.1 at 1744053854
[riscv64] MI2a: requesting to install python3-module-mpmath (unspec'd ver; inspect with Debug::pkgMark-shallow)
[riscv64] MI2a: marked for install (shallow): python3-module-mpmath
[riscv64] MI2a: satisfying Depends: python3(pytest) < 0
[riscv64] MI2a: maybe install (a providing target): python3-module-pytest 9.0.3-alt1:sisyphus_riscv64+118424.100.1.1 at 1775748088
[riscv64] MI2a: target SELECTED: python3-module-pytest 9.0.3-alt1:sisyphus_riscv64+118424.100.1.1 at 1775748088
[riscv64] MI2a: requesting to install python3-module-pytest (unspec'd ver; inspect with Debug::pkgMark-shallow)
[riscv64] MI2a: marked for install (shallow): python3-module-pytest
[riscv64] MI2a: satisfying Depends: python3-module-iniconfig (NULL)
[riscv64] MI2a: maybe install (a direct target): python3-module-iniconfig 2.3.0-alt1:sisyphus_riscv64+98229.100.1.1 at 1761491259
[riscv64] MI2a: target SELECTED: python3-module-iniconfig 2.3.0-alt1:sisyphus_riscv64+98229.100.1.1 at 1761491259
[riscv64] MI2a: requesting to install python3-module-iniconfig (unspec'd ver; inspect with Debug::pkgMark-shallow)
[riscv64] MI2a: marked for install (shallow): python3-module-iniconfig
[riscv64] MI2a: satisfying Depends: python3-module-pluggy (NULL)
[riscv64] MI2a: maybe install (a direct target): python3-module-pluggy 1.6.0-alt1.1:sisyphus_riscv64+116951.300.1.1 at 1774868949
[riscv64] MI2a: target SELECTED: python3-module-pluggy 1.6.0-alt1.1:sisyphus_riscv64+116951.300.1.1 at 1774868949
[riscv64] MI2a: requesting to install python3-module-pluggy (unspec'd ver; inspect with Debug::pkgMark-shallow)
[riscv64] MI2a: marked for install (shallow): python3-module-pluggy
[riscv64] MI2a: satisfying Depends: python3(bs4) < 0
[riscv64] MI2a: maybe install (a providing target): python3-module-beautifulsoup4 4.14.3-alt1.1:sisyphus_riscv64+116930.400.1.1 at 1774849230
[riscv64] MI2a: target SELECTED: python3-module-beautifulsoup4 4.14.3-alt1.1:sisyphus_riscv64+116930.400.1.1 at 1774849230
[riscv64] MI2a: requesting to install python3-module-beautifulsoup4 (unspec'd ver; inspect with Debug::pkgMark-shallow)
[riscv64] MI2a: marked for install (shallow): python3-module-beautifulsoup4
[riscv64] MI2a: satisfying Depends: python3-module-soupsieve (NULL)
[riscv64] MI2a: maybe install (a direct target): python3-module-soupsieve 2.8.3-alt1:sisyphus_riscv64+113222.100.1.1 at 1772777985
[riscv64] MI2a: target SELECTED: python3-module-soupsieve 2.8.3-alt1:sisyphus_riscv64+113222.100.1.1 at 1772777985
[riscv64] MI2a: requesting to install python3-module-soupsieve (unspec'd ver; inspect with Debug::pkgMark-shallow)
[riscv64] MI2a: marked for install (shallow): python3-module-soupsieve
[riscv64] MI2a: satisfying Depends: python3(xlrd) < 0
[riscv64] MI2a: maybe install (a providing target): python3-module-xlrd 2.0.1-alt2.1:sisyphus_riscv64+9374.100.1.1 at 1634374985
[riscv64] MI2a: target SELECTED: python3-module-xlrd 2.0.1-alt2.1:sisyphus_riscv64+9374.100.1.1 at 1634374985
[riscv64] MI2a: requesting to install python3-module-xlrd (unspec'd ver; inspect with Debug::pkgMark-shallow)
[riscv64] MI2a: marked for install (shallow): python3-module-xlrd
[riscv64] MI2a: satisfying Depends: python3(openpyxl) < 0
[riscv64] MI2a: maybe install (a providing target): python3-module-openpyxl 3.1.5-alt1:sisyphus_riscv64+68819.100.1.1 at 1735759371
[riscv64] MI2a: target SELECTED: python3-module-openpyxl 3.1.5-alt1:sisyphus_riscv64+68819.100.1.1 at 1735759371
[riscv64] MI2a: requesting to install python3-module-openpyxl (unspec'd ver; inspect with Debug::pkgMark-shallow)
[riscv64] MI2a: marked for install (shallow): python3-module-openpyxl
[riscv64] MI2a: satisfying Depends: python3(et_xmlfile) < 0
[riscv64] MI2a: maybe install (a providing target): python3-module-et_xmlfile 1.1.0-alt1:sisyphus_riscv64+20124.100.1.1 at 1653430925
[riscv64] MI2a: target SELECTED: python3-module-et_xmlfile 1.1.0-alt1:sisyphus_riscv64+20124.100.1.1 at 1653430925
[riscv64] MI2a: requesting to install python3-module-et_xmlfile (unspec'd ver; inspect with Debug::pkgMark-shallow)
[riscv64] MI2a: marked for install (shallow): python3-module-et_xmlfile
[riscv64] MI2a: satisfying Depends: python3(xlsxwriter) < 0
[riscv64] MI2a: maybe install (a providing target): python3-module-xlsxwriter 3.2.9-alt2:sisyphus_riscv64+99139.300.3.1 at 1761999240
[riscv64] MI2a: target SELECTED: python3-module-xlsxwriter 3.2.9-alt2:sisyphus_riscv64+99139.300.3.1 at 1761999240
[riscv64] MI2a: requesting to install python3-module-xlsxwriter (unspec'd ver; inspect with Debug::pkgMark-shallow)
[riscv64] MI2a: marked for install (shallow): python3-module-xlsxwriter
[riscv64] MI2a: satisfying Depends: python3(xlwt) < 0
[riscv64] MI2a: maybe install (a providing target): python3-module-xlwt 1.3.0-alt2:sisyphus_riscv64+9224.100.1.1 at 1634079467
[riscv64] MI2a: target SELECTED: python3-module-xlwt 1.3.0-alt2:sisyphus_riscv64+9224.100.1.1 at 1634079467
[riscv64] MI2a: requesting to install python3-module-xlwt (unspec'd ver; inspect with Debug::pkgMark-shallow)
[riscv64] MI2a: marked for install (shallow): python3-module-xlwt
[riscv64] MI2a: satisfying Depends: python3(tables) < 0
[riscv64] MI2a: maybe install (a providing target): python3-module-tables 1:3.11.1-alt1:sisyphus_riscv64+112601.100.1.1 at 1772476348
[riscv64] MI2a: target SELECTED: python3-module-tables 1:3.11.1-alt1:sisyphus_riscv64+112601.100.1.1 at 1772476348
[riscv64] MI2a: requesting to install python3-module-tables (unspec'd ver; inspect with Debug::pkgMark-shallow)
[riscv64] MI2a: marked for install (shallow): python3-module-tables
[riscv64] MI2a: satisfying Depends: libblosc.so.1()(64bit) >= set:iegdLlpTJRCTcT0EzJKT8pe4
[riscv64] MI2a: maybe install (a providing target): libblosc 1.21.6-alt1:sisyphus_riscv64+52561.100.1.1 at 1724689732
[riscv64] MI2a: target SELECTED: libblosc 1.21.6-alt1:sisyphus_riscv64+52561.100.1.1 at 1724689732
[riscv64] MI2a: requesting to install libblosc (unspec'd ver; inspect with Debug::pkgMark-shallow)
[riscv64] MI2a: marked for install (shallow): libblosc
[riscv64] MI2a: satisfying Depends: libblosc2.so.7()(64bit) >= set:lfqZJsCI40TgRKPnfYYs8eEH1gtVbtosqTzfGUwUV5X5d1BZFkpu8aZq1kP3vIizTWpqEhb9CPegd6DT1
[riscv64] MI2a: maybe install (a providing target): libblosc2 2.23.1-alt1:sisyphus_riscv64+112866.100.1.1 at 1772609285
[riscv64] MI2a: target SELECTED: libblosc2 2.23.1-alt1:sisyphus_riscv64+112866.100.1.1 at 1772609285
[riscv64] MI2a: requesting to install libblosc2 (unspec'd ver; inspect with Debug::pkgMark-shallow)
[riscv64] MI2a: marked for install (shallow): libblosc2
[riscv64] MI2a: satisfying Depends: liblzo2.so.2()(64bit) >= set:ki25lVugjZj
[riscv64] MI2a: maybe install (a providing target): liblzo2 2.10-alt2:sisyphus_riscv64+9211.100.1.1 at 1634032939
[riscv64] MI2a: target SELECTED: liblzo2 2.10-alt2:sisyphus_riscv64+9211.100.1.1 at 1634032939
[riscv64] MI2a: requesting to install liblzo2 (unspec'd ver; inspect with Debug::pkgMark-shallow)
[riscv64] MI2a: marked for install (shallow): liblzo2
[riscv64] MI2a: satisfying Depends: python3(matplotlib) < 0
[riscv64] MI2a: maybe install (a providing target): python3-module-matplotlib 3.10.8-alt1:sisyphus_riscv64+100672.100.1.1 at 1763117216
[riscv64] MI2a: target SELECTED: python3-module-matplotlib 3.10.8-alt1:sisyphus_riscv64+100672.100.1.1 at 1763117216
[riscv64] MI2a: requesting to install python3-module-matplotlib (unspec'd ver; inspect with Debug::pkgMark-shallow)
[riscv64] MI2a: marked for install (shallow): python3-module-matplotlib
[riscv64] MI2a: satisfying Depends: python3(PIL) < 0
[riscv64] MI2a: maybe install (a providing target): python3-module-pillow 12.2.0-alt1:sisyphus_riscv64+119128.500.1.1 at 1776338725
[riscv64] MI2a: target SELECTED: python3-module-pillow 12.2.0-alt1:sisyphus_riscv64+119128.500.1.1 at 1776338725
[riscv64] MI2a: requesting to install python3-module-pillow (unspec'd ver; inspect with Debug::pkgMark-shallow)
[riscv64] MI2a: marked for install (shallow): python3-module-pillow
[riscv64] MI2a: satisfying Depends: libavif.so.16()(64bit) >= set:kfRrPN57QuiMq9Swi7LRhZCN9ab4PmXiTfiRNESPtxNZkxMY5R86IAZLebNCJD6
[riscv64] MI2a: maybe install (a providing target): libavif 1.4.1-alt1:sisyphus_riscv64+115901.100.1.1 at 1774270071
[riscv64] MI2a: target SELECTED: libavif 1.4.1-alt1:sisyphus_riscv64+115901.100.1.1 at 1774270071
[riscv64] MI2a: requesting to install libavif (unspec'd ver; inspect with Debug::pkgMark-shallow)
[riscv64] MI2a: marked for install (shallow): libavif
[riscv64] MI2a: satisfying Depends: libyuv.so.0()(64bit) >= set:ng3LNTtXH1Zpd4gbsBNT9eNzPZiQb9BUDxYNbNyj8ocPvVZifZLOMuq44lPaxX6NtCGHrsv1V8g4aEpS4OZbrfe6UREOJYZhgd9BZjEKLGanXyPLKt0Zx9YcAaJ0d9Vl7VFMcnv7IOaZi1wEoSoT2sudgBHXbDMB71Pv1UM6BCy3X5wnLIXUu7kS73r2VBN5o
[riscv64] MI2a: maybe install (a providing target): libyuv 0.0.1922-alt0.port:sisyphus_riscv64+104545.100.1.1 at 1766043168
[riscv64] MI2a: target SELECTED: libyuv 0.0.1922-alt0.port:sisyphus_riscv64+104545.100.1.1 at 1766043168
[riscv64] MI2a: requesting to install libyuv (unspec'd ver; inspect with Debug::pkgMark-shallow)
[riscv64] MI2a: marked for install (shallow): libyuv
[riscv64] MI2a: satisfying Depends: libimagequant.so.0()(64bit) >= set:jfQiWD0reiIxv6rvComO8RaS8Zte5C1
[riscv64] MI2a: maybe install (a providing target): libimagequant 2.17.0-alt1_1:sisyphus_riscv64+13475.100.1.1 at 1638490681
[riscv64] MI2a: target SELECTED: libimagequant 2.17.0-alt1_1:sisyphus_riscv64+13475.100.1.1 at 1638490681
[riscv64] MI2a: requesting to install libimagequant (unspec'd ver; inspect with Debug::pkgMark-shallow)
[riscv64] MI2a: marked for install (shallow): libimagequant
[riscv64] MI2a: satisfying Depends: libgomp.so.1()(64bit) >= set:mjKyty17U8lY1hIEgCsq
[riscv64] MI2a: maybe install (a providing target): libgomp1 14.3.1-alt0.port.2:sisyphus_riscv64+98534.200.1.1 at 1761243914
[riscv64] MI2a: target SELECTED: libgomp1 14.3.1-alt0.port.2:sisyphus_riscv64+98534.200.1.1 at 1761243914
[riscv64] MI2a: requesting to install libgomp1 (unspec'd ver; inspect with Debug::pkgMark-shallow)
[riscv64] MI2a: marked for install (shallow): libgomp1
[riscv64] MI2a: satisfying Depends: python3(cycler) < 0
[riscv64] MI2a: maybe install (a providing target): python3-module-cycler 0.12.1-alt1:sisyphus_riscv64+38907.100.1.1 at 1696703246
[riscv64] MI2a: target SELECTED: python3-module-cycler 0.12.1-alt1:sisyphus_riscv64+38907.100.1.1 at 1696703246
[riscv64] MI2a: requesting to install python3-module-cycler (unspec'd ver; inspect with Debug::pkgMark-shallow)
[riscv64] MI2a: marked for install (shallow): python3-module-cycler
[riscv64] MI2a: satisfying Depends: python3(kiwisolver) < 0
[riscv64] MI2a: maybe install (a providing target): python3-module-kiwisolver 1.5.0-alt1:sisyphus_riscv64+113909.100.1.1 at 1773136028
[riscv64] MI2a: target SELECTED: python3-module-kiwisolver 1.5.0-alt1:sisyphus_riscv64+113909.100.1.1 at 1773136028
[riscv64] MI2a: requesting to install python3-module-kiwisolver (unspec'd ver; inspect with Debug::pkgMark-shallow)
[riscv64] MI2a: marked for install (shallow): python3-module-kiwisolver
[riscv64] MI2a: satisfying Depends: python3(pyparsing) < 0
[riscv64] MI2a: maybe install (a providing target): python3-module-pyparsing 3.3.2-alt1.1:sisyphus_riscv64+116970.100.1.1 at 1774891711
[riscv64] MI2a: target SELECTED: python3-module-pyparsing 3.3.2-alt1.1:sisyphus_riscv64+116970.100.1.1 at 1774891711
[riscv64] MI2a: requesting to install python3-module-pyparsing (unspec'd ver; inspect with Debug::pkgMark-shallow)
[riscv64] MI2a: marked for install (shallow): python3-module-pyparsing
[riscv64] MI2a: satisfying Depends: python3(railroad) < 0
[riscv64] MI2a: maybe install (a providing target): python3-module-railroad-diagrams 3.0.1-alt1.1:sisyphus_riscv64+116967.300.1.1 at 1774889343
[riscv64] MI2a: target SELECTED: python3-module-railroad-diagrams 3.0.1-alt1.1:sisyphus_riscv64+116967.300.1.1 at 1774889343
[riscv64] MI2a: requesting to install python3-module-railroad-diagrams (unspec'd ver; inspect with Debug::pkgMark-shallow)
[riscv64] MI2a: marked for install (shallow): python3-module-railroad-diagrams
[riscv64] MI2a: satisfying Depends: python3-module-mpl_toolkits = 3.10.8-alt1:sisyphus_riscv64+100672.100.1.1
[riscv64] MI2a: maybe install (a direct target): python3-module-mpl_toolkits 3.10.8-alt1:sisyphus_riscv64+100672.100.1.1 at 1763117216
[riscv64] MI2a: target SELECTED: python3-module-mpl_toolkits 3.10.8-alt1:sisyphus_riscv64+100672.100.1.1 at 1763117216
[riscv64] MI2a: requesting to install python3-module-mpl_toolkits (unspec'd ver; inspect with Debug::pkgMark-shallow)
[riscv64] MI2a: marked for install (shallow): python3-module-mpl_toolkits
[riscv64] MI2a: satisfying Depends: python3-module-matplotlib-data = 3.10.8-alt1:sisyphus_riscv64+100672.100.1.1
[riscv64] MI2a: maybe install (a direct target): python3-module-matplotlib-data 3.10.8-alt1:sisyphus_riscv64+100672.100.1.1 at 1763117216
[riscv64] MI2a: target SELECTED: python3-module-matplotlib-data 3.10.8-alt1:sisyphus_riscv64+100672.100.1.1 at 1763117216
[riscv64] MI2a: requesting to install python3-module-matplotlib-data (unspec'd ver; inspect with Debug::pkgMark-shallow)
[riscv64] MI2a: marked for install (shallow): python3-module-matplotlib-data
[riscv64] MI2a: satisfying Depends: python3(pandas._testing) < 0
[riscv64] MI2a: maybe install (a providing target): python3-module-pandas-tests 2.3.3-alt1:sisyphus_riscv64+97959.100.1.1 at 1761443514
[riscv64] MI2a: target SELECTED: python3-module-pandas-tests 2.3.3-alt1:sisyphus_riscv64+97959.100.1.1 at 1761443514
[riscv64] MI2a: requesting to install python3-module-pandas-tests (unspec'd ver; inspect with Debug::pkgMark-shallow)
[riscv64] MI2a: marked for install (shallow): python3-module-pandas-tests
[riscv64] MI2a: satisfying Depends: python3(pymysql) < 0
[riscv64] MI2a: maybe install (a providing target): python3-module-pymysql 1.1.2-alt1:sisyphus_riscv64+93992.100.1.1 at 1756976041
[riscv64] MI2a: target SELECTED: python3-module-pymysql 1.1.2-alt1:sisyphus_riscv64+93992.100.1.1 at 1756976041
[riscv64] MI2a: requesting to install python3-module-pymysql (unspec'd ver; inspect with Debug::pkgMark-shallow)
[riscv64] MI2a: marked for install (shallow): python3-module-pymysql
[riscv64] MI2a: satisfying Depends: python3(psycopg2) < 0
[riscv64] MI2a: maybe install (a providing target): python3-module-psycopg2 2.9.11-alt1:sisyphus_riscv64+97162.100.1.1 at 1761060837
[riscv64] MI2a: target SELECTED: python3-module-psycopg2 2.9.11-alt1:sisyphus_riscv64+97162.100.1.1 at 1761060837
[riscv64] MI2a: requesting to install python3-module-psycopg2 (unspec'd ver; inspect with Debug::pkgMark-shallow)
[riscv64] MI2a: marked for install (shallow): python3-module-psycopg2
[riscv64] MI2a: satisfying Depends: python3(hypothesis) < 0
[riscv64] MI2a: maybe install (a providing target): python3-module-hypothesis 6.151.14-alt0.port:sisyphus_riscv64+119362.100.1.1 at 1776348605
[riscv64] MI2a: target SELECTED: python3-module-hypothesis 6.151.14-alt0.port:sisyphus_riscv64+119362.100.1.1 at 1776348605
[riscv64] MI2a: requesting to install python3-module-hypothesis (unspec'd ver; inspect with Debug::pkgMark-shallow)
[riscv64] MI2a: marked for install (shallow): python3-module-hypothesis
[riscv64] MI2a: satisfying Depends: python3-module-sortedcontainers (NULL)
[riscv64] MI2a: maybe install (a direct target): python3-module-sortedcontainers 2.4.0-alt1:sisyphus_riscv64+9378.100.1.1 at 1634376330
[riscv64] MI2a: target SELECTED: python3-module-sortedcontainers 2.4.0-alt1:sisyphus_riscv64+9378.100.1.1 at 1634376330
[riscv64] MI2a: requesting to install python3-module-sortedcontainers (unspec'd ver; inspect with Debug::pkgMark-shallow)
[riscv64] MI2a: marked for install (shallow): python3-module-sortedcontainers
[riscv64] MI2a: satisfying Depends: python3(pyarrow.compute) < 0
[riscv64] MI2a: maybe install (a providing target): python3-module-pyarrow 12.0.0-alt2.6:sisyphus_riscv64+96790.133700.18.1 at 1760888139
[riscv64] MI2a: target SELECTED: python3-module-pyarrow 12.0.0-alt2.6:sisyphus_riscv64+96790.133700.18.1 at 1760888139
[riscv64] MI2a: requesting to install python3-module-pyarrow (unspec'd ver; inspect with Debug::pkgMark-shallow)
[riscv64] MI2a: marked for install (shallow): python3-module-pyarrow
[riscv64] MI2a: satisfying Depends: python3(cffi) < 0
[riscv64] MI2a: maybe install (a providing target): python3-module-cffi 2.0.0-alt1:sisyphus_riscv64+97411.600.1.1 at 1761223714
[riscv64] MI2a: target SELECTED: python3-module-cffi 2.0.0-alt1:sisyphus_riscv64+97411.600.1.1 at 1761223714
[riscv64] MI2a: requesting to install python3-module-cffi (unspec'd ver; inspect with Debug::pkgMark-shallow)
[riscv64] MI2a: marked for install (shallow): python3-module-cffi
[riscv64] MI2a: satisfying Depends: python3-module-pycparser (NULL)
[riscv64] MI2a: maybe install (a direct target): python3-module-pycparser 2.23-alt1:sisyphus_riscv64+113531.100.1.1 at 1773048157
[riscv64] MI2a: target SELECTED: python3-module-pycparser 2.23-alt1:sisyphus_riscv64+113531.100.1.1 at 1773048157
[riscv64] MI2a: requesting to install python3-module-pycparser (unspec'd ver; inspect with Debug::pkgMark-shallow)
[riscv64] MI2a: marked for install (shallow): python3-module-pycparser
[riscv64] MI2a: satisfying Depends: arrow-devel = 12.0.0-alt2.6:sisyphus_riscv64+96790.133700.18.1
[riscv64] MI2a: maybe install (a direct target): arrow-devel 12.0.0-alt2.6:sisyphus_riscv64+96790.133700.18.1 at 1760888139
[riscv64] MI2a: target SELECTED: arrow-devel 12.0.0-alt2.6:sisyphus_riscv64+96790.133700.18.1 at 1760888139
[riscv64] MI2a: requesting to install arrow-devel (unspec'd ver; inspect with Debug::pkgMark-shallow)
[riscv64] MI2a: marked for install (shallow): arrow-devel
[riscv64] MI2a: satisfying Depends: libbrotli-devel (NULL)
[riscv64] MI2a: maybe install (a direct target): libbrotli-devel 1.2.0-alt1:sisyphus_riscv64+98962.100.1.1 at 1761678642
[riscv64] MI2a: target SELECTED: libbrotli-devel 1.2.0-alt1:sisyphus_riscv64+98962.100.1.1 at 1761678642
[riscv64] MI2a: requesting to install libbrotli-devel (unspec'd ver; inspect with Debug::pkgMark-shallow)
[riscv64] MI2a: marked for install (shallow): libbrotli-devel
[riscv64] MI2a: satisfying Depends: libbrotlienc = 1.2.0-alt1:sisyphus_riscv64+98962.100.1.1
[riscv64] MI2a: maybe install (a direct target): libbrotlienc 1.2.0-alt1:sisyphus_riscv64+98962.100.1.1 at 1761678642
[riscv64] MI2a: target SELECTED: libbrotlienc 1.2.0-alt1:sisyphus_riscv64+98962.100.1.1 at 1761678642
[riscv64] MI2a: requesting to install libbrotlienc (unspec'd ver; inspect with Debug::pkgMark-shallow)
[riscv64] MI2a: marked for install (shallow): libbrotlienc
[riscv64] MI2a: satisfying Depends: bzlib-devel (NULL)
[riscv64] MI2a: maybe install (a direct target): bzlib-devel 1:1.0.8-alt3:sisyphus_riscv64+46768.1100.1.1 at 1711599320
[riscv64] MI2a: target SELECTED: bzlib-devel 1:1.0.8-alt3:sisyphus_riscv64+46768.1100.1.1 at 1711599320
[riscv64] MI2a: requesting to install bzlib-devel (unspec'd ver; inspect with Debug::pkgMark-shallow)
[riscv64] MI2a: marked for install (shallow): bzlib-devel
[riscv64] MI2a: satisfying Depends: libcares-devel (NULL)
[riscv64] MI2a: maybe install (a direct target): libcares-devel 1.34.6-alt1:sisyphus_riscv64+103419.100.1.1 at 1765344127
[riscv64] MI2a: target SELECTED: libcares-devel 1.34.6-alt1:sisyphus_riscv64+103419.100.1.1 at 1765344127
[riscv64] MI2a: requesting to install libcares-devel (unspec'd ver; inspect with Debug::pkgMark-shallow)
[riscv64] MI2a: marked for install (shallow): libcares-devel
[riscv64] MI2a: satisfying Depends: libcares = 1.34.6-alt1:sisyphus_riscv64+103419.100.1.1
[riscv64] MI2a: maybe install (a direct target): libcares 1.34.6-alt1:sisyphus_riscv64+103419.100.1.1 at 1765344127
[riscv64] MI2a: target SELECTED: libcares 1.34.6-alt1:sisyphus_riscv64+103419.100.1.1 at 1765344127
[riscv64] MI2a: requesting to install libcares (unspec'd ver; inspect with Debug::pkgMark-shallow)
[riscv64] MI2a: marked for install (shallow): libcares
[riscv64] MI2a: satisfying Depends: libgflags-devel (NULL)
[riscv64] MI2a: maybe install (a direct target): libgflags-devel 2.2.2-alt3:sisyphus_riscv64+32669.100.1.1 at 1683809423
[riscv64] MI2a: target SELECTED: libgflags-devel 2.2.2-alt3:sisyphus_riscv64+32669.100.1.1 at 1683809423
[riscv64] MI2a: requesting to install libgflags-devel (unspec'd ver; inspect with Debug::pkgMark-shallow)
[riscv64] MI2a: marked for install (shallow): libgflags-devel
[riscv64] MI2a: satisfying Depends: libgflags = 2.2.2-alt3:sisyphus_riscv64+32669.100.1.1
[riscv64] MI2a: maybe install (a direct target): libgflags 2.2.2-alt3:sisyphus_riscv64+32669.100.1.1 at 1683809423
[riscv64] MI2a: target SELECTED: libgflags 2.2.2-alt3:sisyphus_riscv64+32669.100.1.1 at 1683809423
[riscv64] MI2a: requesting to install libgflags (unspec'd ver; inspect with Debug::pkgMark-shallow)
[riscv64] MI2a: marked for install (shallow): libgflags
[riscv64] MI2a: satisfying Depends: libglog-devel (NULL)
[riscv64] MI2a: maybe install (a direct target): libglog-devel 0.7.1-alt1:sisyphus_riscv64+52589.100.1.1 at 1724753153
[riscv64] MI2a: target SELECTED: libglog-devel 0.7.1-alt1:sisyphus_riscv64+52589.100.1.1 at 1724753153
[riscv64] MI2a: requesting to install libglog-devel (unspec'd ver; inspect with Debug::pkgMark-shallow)
[riscv64] MI2a: marked for install (shallow): libglog-devel
[riscv64] MI2a: satisfying Depends: libglog2 = 0.7.1-alt1:sisyphus_riscv64+52589.100.1.1
[riscv64] MI2a: maybe install (a direct target): libglog2 0.7.1-alt1:sisyphus_riscv64+52589.100.1.1 at 1724753153
[riscv64] MI2a: target SELECTED: libglog2 0.7.1-alt1:sisyphus_riscv64+52589.100.1.1 at 1724753153
[riscv64] MI2a: requesting to install libglog2 (unspec'd ver; inspect with Debug::pkgMark-shallow)
[riscv64] MI2a: marked for install (shallow): libglog2
[riscv64] MI2a: satisfying Depends: jsoncpp-devel (NULL)
[riscv64] MI2a: maybe install (a direct target): jsoncpp-devel 1.9.4-alt2:sisyphus_riscv64+49295.100.1.1 at 1716568573
[riscv64] MI2a: target SELECTED: jsoncpp-devel 1.9.4-alt2:sisyphus_riscv64+49295.100.1.1 at 1716568573
[riscv64] MI2a: requesting to install jsoncpp-devel (unspec'd ver; inspect with Debug::pkgMark-shallow)
[riscv64] MI2a: marked for install (shallow): jsoncpp-devel
[riscv64] MI2a: satisfying Depends: liblz4-devel (NULL)
[riscv64] MI2a: maybe install (a direct target): liblz4-devel 1:1.9.4-alt1:sisyphus_riscv64+25607.100.1.1 at 1667437030
[riscv64] MI2a: target SELECTED: liblz4-devel 1:1.9.4-alt1:sisyphus_riscv64+25607.100.1.1 at 1667437030
[riscv64] MI2a: requesting to install liblz4-devel (unspec'd ver; inspect with Debug::pkgMark-shallow)
[riscv64] MI2a: marked for install (shallow): liblz4-devel
[riscv64] MI2a: satisfying Depends: rapidjson-devel (NULL)
[riscv64] MI2a: maybe install (a direct target): rapidjson-devel 1.1.0-alt9.git473553bd:sisyphus_riscv64+106432.100.1.1 at 1768172344
[riscv64] MI2a: target SELECTED: rapidjson-devel 1.1.0-alt9.git473553bd:sisyphus_riscv64+106432.100.1.1 at 1768172344
[riscv64] MI2a: requesting to install rapidjson-devel (unspec'd ver; inspect with Debug::pkgMark-shallow)
[riscv64] MI2a: marked for install (shallow): rapidjson-devel
[riscv64] MI2a: satisfying Depends: libre2-devel (NULL)
[riscv64] MI2a: maybe install (a direct target): libre2-devel 20251105-alt1:sisyphus_riscv64+103354.100.1.1 at 1765316100
[riscv64] MI2a: target SELECTED: libre2-devel 20251105-alt1:sisyphus_riscv64+103354.100.1.1 at 1765316100
[riscv64] MI2a: requesting to install libre2-devel (unspec'd ver; inspect with Debug::pkgMark-shallow)
[riscv64] MI2a: marked for install (shallow): libre2-devel
[riscv64] MI2a: satisfying Depends: libabseil-cpp-devel (NULL)
[riscv64] MI2a: maybe install (a direct target): libabseil-cpp-devel 20250127.1-alt2:sisyphus_riscv64+88492.100.1.1 at 1751624519
[riscv64] MI2a: target SELECTED: libabseil-cpp-devel 20250127.1-alt2:sisyphus_riscv64+88492.100.1.1 at 1751624519
[riscv64] MI2a: requesting to install libabseil-cpp-devel (unspec'd ver; inspect with Debug::pkgMark-shallow)
[riscv64] MI2a: marked for install (shallow): libabseil-cpp-devel
[riscv64] MI2a: satisfying Depends: libgmock-devel (NULL)
[riscv64] MI2a: maybe install (a direct target): libgmock-devel 1.17.0-alt1.1:sisyphus_riscv64+104610.100.1.1 at 1766077287
[riscv64] MI2a: target SELECTED: libgmock-devel 1.17.0-alt1.1:sisyphus_riscv64+104610.100.1.1 at 1766077287
[riscv64] MI2a: requesting to install libgmock-devel (unspec'd ver; inspect with Debug::pkgMark-shallow)
[riscv64] MI2a: marked for install (shallow): libgmock-devel
[riscv64] MI2a: satisfying Depends: libgtest-devel = 1.17.0-alt1.1:sisyphus_riscv64+104610.100.1.1
[riscv64] MI2a: maybe install (a direct target): libgtest-devel 1.17.0-alt1.1:sisyphus_riscv64+104610.100.1.1 at 1766077287
[riscv64] MI2a: target SELECTED: libgtest-devel 1.17.0-alt1.1:sisyphus_riscv64+104610.100.1.1 at 1766077287
[riscv64] MI2a: requesting to install libgtest-devel (unspec'd ver; inspect with Debug::pkgMark-shallow)
[riscv64] MI2a: marked for install (shallow): libgtest-devel
[riscv64] MI2a: satisfying Depends: libgmock = 1.17.0-alt1.1:sisyphus_riscv64+104610.100.1.1
[riscv64] MI2a: maybe install (a direct target): libgmock 1.17.0-alt1.1:sisyphus_riscv64+104610.100.1.1 at 1766077287
[riscv64] MI2a: target SELECTED: libgmock 1.17.0-alt1.1:sisyphus_riscv64+104610.100.1.1 at 1766077287
[riscv64] MI2a: requesting to install libgmock (unspec'd ver; inspect with Debug::pkgMark-shallow)
[riscv64] MI2a: marked for install (shallow): libgmock
[riscv64] MI2a: satisfying Depends: libgtest = 1.17.0-alt1.1:sisyphus_riscv64+104610.100.1.1
[riscv64] MI2a: maybe install (a direct target): libgtest 1.17.0-alt1.1:sisyphus_riscv64+104610.100.1.1 at 1766077287
[riscv64] MI2a: target SELECTED: libgtest 1.17.0-alt1.1:sisyphus_riscv64+104610.100.1.1 at 1766077287
[riscv64] MI2a: requesting to install libgtest (unspec'd ver; inspect with Debug::pkgMark-shallow)
[riscv64] MI2a: marked for install (shallow): libgtest
[riscv64] MI2a: satisfying Depends: libabseil-cpp-testing = 20250127.1-alt2:sisyphus_riscv64+88492.100.1.1
[riscv64] MI2a: maybe install (a direct target): libabseil-cpp-testing 20250127.1-alt2:sisyphus_riscv64+88492.100.1.1 at 1751624519
[riscv64] MI2a: target SELECTED: libabseil-cpp-testing 20250127.1-alt2:sisyphus_riscv64+88492.100.1.1 at 1751624519
[riscv64] MI2a: requesting to install libabseil-cpp-testing (unspec'd ver; inspect with Debug::pkgMark-shallow)
[riscv64] MI2a: marked for install (shallow): libabseil-cpp-testing
[riscv64] MI2a: satisfying Depends: libabseil-cpp2501.0.0 = 20250127.1-alt2:sisyphus_riscv64+88492.100.1.1
[riscv64] MI2a: maybe install (a direct target): libabseil-cpp2501.0.0 20250127.1-alt2:sisyphus_riscv64+88492.100.1.1 at 1751624519
[riscv64] MI2a: target SELECTED: libabseil-cpp2501.0.0 20250127.1-alt2:sisyphus_riscv64+88492.100.1.1 at 1751624519
[riscv64] MI2a: requesting to install libabseil-cpp2501.0.0 (unspec'd ver; inspect with Debug::pkgMark-shallow)
[riscv64] MI2a: marked for install (shallow): libabseil-cpp2501.0.0
[riscv64] MI2a: satisfying Depends: libre2_11 = 20251105-alt1:sisyphus_riscv64+103354.100.1.1
[riscv64] MI2a: maybe install (a direct target): libre2_11 20251105-alt1:sisyphus_riscv64+103354.100.1.1 at 1765316100
[riscv64] MI2a: target SELECTED: libre2_11 20251105-alt1:sisyphus_riscv64+103354.100.1.1 at 1765316100
[riscv64] MI2a: requesting to install libre2_11 (unspec'd ver; inspect with Debug::pkgMark-shallow)
[riscv64] MI2a: marked for install (shallow): libre2_11
[riscv64] MI2a: satisfying Depends: libsnappy-devel (NULL)
[riscv64] MI2a: maybe install (a direct target): libsnappy-devel 1.2.2-alt2:sisyphus_riscv64+110125.100.1.1 at 1770753461
[riscv64] MI2a: target SELECTED: libsnappy-devel 1.2.2-alt2:sisyphus_riscv64+110125.100.1.1 at 1770753461
[riscv64] MI2a: requesting to install libsnappy-devel (unspec'd ver; inspect with Debug::pkgMark-shallow)
[riscv64] MI2a: marked for install (shallow): libsnappy-devel
[riscv64] MI2a: satisfying Depends: thrift-devel (NULL)
[riscv64] MI2a: maybe install (a direct target): thrift-devel 0.18.1-alt1:sisyphus_riscv64+96790.36200.6.1 at 1760308149
[riscv64] MI2a: target SELECTED: thrift-devel 0.18.1-alt1:sisyphus_riscv64+96790.36200.6.1 at 1760308149
[riscv64] MI2a: requesting to install thrift-devel (unspec'd ver; inspect with Debug::pkgMark-shallow)
[riscv64] MI2a: marked for install (shallow): thrift-devel
[riscv64] MI2a: satisfying Depends: glib2-devel (NULL)
[riscv64] MI2a: maybe install (a direct target): glib2-devel 2.88.0-alt1:sisyphus_riscv64+115074.100.1.1 at 1773735024
[riscv64] MI2a: target SELECTED: glib2-devel 2.88.0-alt1:sisyphus_riscv64+115074.100.1.1 at 1773735024
[riscv64] MI2a: requesting to install glib2-devel (unspec'd ver; inspect with Debug::pkgMark-shallow)
[riscv64] MI2a: marked for install (shallow): glib2-devel
[riscv64] MI2a: satisfying Depends: rpm-build-gir >= 0.5
[riscv64] MI2a: maybe install (a direct target): rpm-build-gir 0.7.3-alt3.1:sisyphus_riscv64+32169.100.1.1 at 1683014292
[riscv64] MI2a: target SELECTED: rpm-build-gir 0.7.3-alt3.1:sisyphus_riscv64+32169.100.1.1 at 1683014292
[riscv64] MI2a: requesting to install rpm-build-gir (unspec'd ver; inspect with Debug::pkgMark-shallow)
[riscv64] MI2a: marked for install (shallow): rpm-build-gir
[riscv64] MI2a: satisfying Depends: libevent-devel (NULL)
[riscv64] MI2a: maybe install (a direct target): libevent-devel 2.1.12-alt1:sisyphus_riscv64+35115.100.1.1 at 1689891017
[riscv64] MI2a: target SELECTED: libevent-devel 2.1.12-alt1:sisyphus_riscv64+35115.100.1.1 at 1689891017
[riscv64] MI2a: requesting to install libevent-devel (unspec'd ver; inspect with Debug::pkgMark-shallow)
[riscv64] MI2a: marked for install (shallow): libevent-devel
[riscv64] MI2a: satisfying Depends: libevent2.1 = 2.1.12-alt1:sisyphus_riscv64+35115.100.1.1
[riscv64] MI2a: maybe install (a direct target): libevent2.1 2.1.12-alt1:sisyphus_riscv64+35115.100.1.1 at 1689891017
[riscv64] MI2a: target SELECTED: libevent2.1 2.1.12-alt1:sisyphus_riscv64+35115.100.1.1 at 1689891017
[riscv64] MI2a: requesting to install libevent2.1 (unspec'd ver; inspect with Debug::pkgMark-shallow)
[riscv64] MI2a: marked for install (shallow): libevent2.1
[riscv64] MI2a: satisfying Depends: thrift-qt5 = 0.18.1-alt1:sisyphus_riscv64+96790.36200.6.1
[riscv64] MI2a: maybe install (a direct target): thrift-qt5 0.18.1-alt1:sisyphus_riscv64+96790.36200.6.1 at 1760308149
[riscv64] MI2a: target SELECTED: thrift-qt5 0.18.1-alt1:sisyphus_riscv64+96790.36200.6.1 at 1760308149
[riscv64] MI2a: requesting to install thrift-qt5 (unspec'd ver; inspect with Debug::pkgMark-shallow)
[riscv64] MI2a: marked for install (shallow): thrift-qt5
[riscv64] MI2a: satisfying Depends: libQt5Core.so.5()(64bit) >= set:qkpbM0RycmEV9f6hZ6wZFZKD2HVpyjX803mz9WrIQ1xTowh0LPKZiWIlp1wcfeOoNwAXDloYZ0lucXikdDythAgBOyud9Ggk8fCx0AFQeJv3
[riscv64] MI2a: maybe install (a providing target): libqt5-core 5.15.18-alt1:sisyphus_riscv64+111157.100.1.1 at 1771626923
[riscv64] MI2a: target SELECTED: libqt5-core 5.15.18-alt1:sisyphus_riscv64+111157.100.1.1 at 1771626923
[riscv64] MI2a: requesting to install libqt5-core (unspec'd ver; inspect with Debug::pkgMark-shallow)
[riscv64] MI2a: marked for install (shallow): libqt5-core
[riscv64] MI2a: satisfying Depends: libdouble-conversion.so.3()(64bit) >= set:jhd56f00
[riscv64] MI2a: maybe install (a providing target): libdouble-conversion3 3.4.0-alt1:sisyphus_riscv64+104494.100.1.1 at 1765973823
[riscv64] MI2a: target SELECTED: libdouble-conversion3 3.4.0-alt1:sisyphus_riscv64+104494.100.1.1 at 1765973823
[riscv64] MI2a: requesting to install libdouble-conversion3 (unspec'd ver; inspect with Debug::pkgMark-shallow)
[riscv64] MI2a: marked for install (shallow): libdouble-conversion3
[riscv64] MI2a: satisfying Depends: qt5-base-common = 5.15.18-alt1:sisyphus_riscv64+111157.100.1.1
[riscv64] MI2a: maybe install (a direct target): qt5-base-common 5.15.18-alt1:sisyphus_riscv64+111157.100.1.1 at 1771626923
[riscv64] MI2a: target SELECTED: qt5-base-common 5.15.18-alt1:sisyphus_riscv64+111157.100.1.1 at 1771626923
[riscv64] MI2a: requesting to install qt5-base-common (unspec'd ver; inspect with Debug::pkgMark-shallow)
[riscv64] MI2a: marked for install (shallow): qt5-base-common
[riscv64] MI2a: satisfying Depends: libQt5Network.so.5()(64bit) >= set:olk9NPj7dvKn8Xn1
[riscv64] MI2a: maybe install (a providing target): libqt5-network 5.15.18-alt1:sisyphus_riscv64+111157.100.1.1 at 1771626923
[riscv64] MI2a: target SELECTED: libqt5-network 5.15.18-alt1:sisyphus_riscv64+111157.100.1.1 at 1771626923
[riscv64] MI2a: requesting to install libqt5-network (unspec'd ver; inspect with Debug::pkgMark-shallow)
[riscv64] MI2a: marked for install (shallow): libqt5-network
[riscv64] MI2a: satisfying Depends: libproxy.so.1()(64bit) >= set:geZnvsbd3
[riscv64] MI2a: maybe install (a providing target): libproxy 0.5.12-alt1:sisyphus_riscv64+111309.100.1.1 at 1771649231
[riscv64] MI2a: target SELECTED: libproxy 0.5.12-alt1:sisyphus_riscv64+111309.100.1.1 at 1771649231
[riscv64] MI2a: requesting to install libproxy (unspec'd ver; inspect with Debug::pkgMark-shallow)
[riscv64] MI2a: marked for install (shallow): libproxy
[riscv64] MI2a: satisfying Depends: libduktape.so.207()(64bit) >= set:miaJVNhBCDjn2ub7iTaHfLD9E0Jj0C8PSCSZ4fSxs
[riscv64] MI2a: maybe install (a providing target): libduktape207 2.7.0-alt3:sisyphus_riscv64+50909.100.1.1 at 1720347275
[riscv64] MI2a: target SELECTED: libduktape207 2.7.0-alt3:sisyphus_riscv64+50909.100.1.1 at 1720347275
[riscv64] MI2a: requesting to install libduktape207 (unspec'd ver; inspect with Debug::pkgMark-shallow)
[riscv64] MI2a: marked for install (shallow): libduktape207
[riscv64] MI2a: satisfying Depends: libqt5-dbus = 5.15.18-alt1:sisyphus_riscv64+111157.100.1.1
[riscv64] MI2a: maybe install (a direct target): libqt5-dbus 5.15.18-alt1:sisyphus_riscv64+111157.100.1.1 at 1771626923
[riscv64] MI2a: target SELECTED: libqt5-dbus 5.15.18-alt1:sisyphus_riscv64+111157.100.1.1 at 1771626923
[riscv64] MI2a: requesting to install libqt5-dbus (unspec'd ver; inspect with Debug::pkgMark-shallow)
[riscv64] MI2a: marked for install (shallow): libqt5-dbus
[riscv64] MI2a: satisfying Depends: thrift = 0.18.1-alt1:sisyphus_riscv64+96790.36200.6.1
[riscv64] MI2a: maybe install (a direct target): thrift 0.18.1-alt1:sisyphus_riscv64+96790.36200.6.1 at 1760308149
[riscv64] MI2a: target SELECTED: thrift 0.18.1-alt1:sisyphus_riscv64+96790.36200.6.1 at 1760308149
[riscv64] MI2a: requesting to install thrift (unspec'd ver; inspect with Debug::pkgMark-shallow)
[riscv64] MI2a: marked for install (shallow): thrift
[riscv64] MI2a: satisfying Depends: thrift-glib = 0.18.1-alt1:sisyphus_riscv64+96790.36200.6.1
[riscv64] MI2a: maybe install (a direct target): thrift-glib 0.18.1-alt1:sisyphus_riscv64+96790.36200.6.1 at 1760308149
[riscv64] MI2a: target SELECTED: thrift-glib 0.18.1-alt1:sisyphus_riscv64+96790.36200.6.1 at 1760308149
[riscv64] MI2a: requesting to install thrift-glib (unspec'd ver; inspect with Debug::pkgMark-shallow)
[riscv64] MI2a: marked for install (shallow): thrift-glib
[riscv64] MI2a: satisfying Depends: libutf8proc-devel (NULL)
[riscv64] MI2a: maybe install (a direct target): libutf8proc-devel 2.11.3-alt1:sisyphus_riscv64+106507.100.1.1 at 1768227981
[riscv64] MI2a: target SELECTED: libutf8proc-devel 2.11.3-alt1:sisyphus_riscv64+106507.100.1.1 at 1768227981
[riscv64] MI2a: requesting to install libutf8proc-devel (unspec'd ver; inspect with Debug::pkgMark-shallow)
[riscv64] MI2a: marked for install (shallow): libutf8proc-devel
[riscv64] MI2a: satisfying Depends: libutf8proc3 = 2.11.3-alt1:sisyphus_riscv64+106507.100.1.1
[riscv64] MI2a: maybe install (a direct target): libutf8proc3 2.11.3-alt1:sisyphus_riscv64+106507.100.1.1 at 1768227981
[riscv64] MI2a: target SELECTED: libutf8proc3 2.11.3-alt1:sisyphus_riscv64+106507.100.1.1 at 1768227981
[riscv64] MI2a: requesting to install libutf8proc3 (unspec'd ver; inspect with Debug::pkgMark-shallow)
[riscv64] MI2a: marked for install (shallow): libutf8proc3
[riscv64] MI2a: satisfying Depends: libbenchmark-devel (NULL)
[riscv64] MI2a: maybe install (a direct target): libbenchmark-devel 1.9.5-alt1:sisyphus_riscv64+107725.100.1.2 at 1769238292
[riscv64] MI2a: target SELECTED: libbenchmark-devel 1.9.5-alt1:sisyphus_riscv64+107725.100.1.2 at 1769238292
[riscv64] MI2a: requesting to install libbenchmark-devel (unspec'd ver; inspect with Debug::pkgMark-shallow)
[riscv64] MI2a: marked for install (shallow): libbenchmark-devel
[riscv64] MI2a: satisfying Depends: libbenchmark = 1.9.5-alt1:sisyphus_riscv64+107725.100.1.2
[riscv64] MI2a: maybe install (a direct target): libbenchmark 1.9.5-alt1:sisyphus_riscv64+107725.100.1.2 at 1769238292
[riscv64] MI2a: target SELECTED: libbenchmark 1.9.5-alt1:sisyphus_riscv64+107725.100.1.2 at 1769238292
[riscv64] MI2a: requesting to install libbenchmark (unspec'd ver; inspect with Debug::pkgMark-shallow)
[riscv64] MI2a: marked for install (shallow): libbenchmark
[riscv64] MI2a: satisfying Depends: xsimd-devel (NULL)
[riscv64] MI2a: maybe install (a direct target): xsimd-devel 14.1.0-alt1:sisyphus_riscv64+119619.100.1.1 at 1776662046
[riscv64] MI2a: target SELECTED: xsimd-devel 14.1.0-alt1:sisyphus_riscv64+119619.100.1.1 at 1776662046
[riscv64] MI2a: requesting to install xsimd-devel (unspec'd ver; inspect with Debug::pkgMark-shallow)
[riscv64] MI2a: marked for install (shallow): xsimd-devel
[riscv64] MI2a: satisfying Depends: libarrow = 12.0.0-alt2.6:sisyphus_riscv64+96790.133700.18.1
[riscv64] MI2a: maybe install (a direct target): libarrow 12.0.0-alt2.6:sisyphus_riscv64+96790.133700.18.1 at 1760888139
[riscv64] MI2a: target SELECTED: libarrow 12.0.0-alt2.6:sisyphus_riscv64+96790.133700.18.1 at 1760888139
[riscv64] MI2a: requesting to install libarrow (unspec'd ver; inspect with Debug::pkgMark-shallow)
[riscv64] MI2a: marked for install (shallow): libarrow
[riscv64] MI2a: satisfying Depends: libarrow-dataset = 12.0.0-alt2.6:sisyphus_riscv64+96790.133700.18.1
[riscv64] MI2a: maybe install (a direct target): libarrow-dataset 12.0.0-alt2.6:sisyphus_riscv64+96790.133700.18.1 at 1760888139
[riscv64] MI2a: target SELECTED: libarrow-dataset 12.0.0-alt2.6:sisyphus_riscv64+96790.133700.18.1 at 1760888139
[riscv64] MI2a: requesting to install libarrow-dataset (unspec'd ver; inspect with Debug::pkgMark-shallow)
[riscv64] MI2a: marked for install (shallow): libarrow-dataset
[riscv64] MI2a: satisfying Depends: libarrow-acero = 12.0.0-alt2.6:sisyphus_riscv64+96790.133700.18.1
[riscv64] MI2a: maybe install (a direct target): libarrow-acero 12.0.0-alt2.6:sisyphus_riscv64+96790.133700.18.1 at 1760888139
[riscv64] MI2a: target SELECTED: libarrow-acero 12.0.0-alt2.6:sisyphus_riscv64+96790.133700.18.1 at 1760888139
[riscv64] MI2a: requesting to install libarrow-acero (unspec'd ver; inspect with Debug::pkgMark-shallow)
[riscv64] MI2a: marked for install (shallow): libarrow-acero
[riscv64] MI2a: satisfying Depends: libparquet = 12.0.0-alt2.6:sisyphus_riscv64+96790.133700.18.1
[riscv64] MI2a: maybe install (a direct target): libparquet 12.0.0-alt2.6:sisyphus_riscv64+96790.133700.18.1 at 1760888139
[riscv64] MI2a: target SELECTED: libparquet 12.0.0-alt2.6:sisyphus_riscv64+96790.133700.18.1 at 1760888139
[riscv64] MI2a: requesting to install libparquet (unspec'd ver; inspect with Debug::pkgMark-shallow)
[riscv64] MI2a: marked for install (shallow): libparquet
[riscv64] MI2a: satisfying Depends: openssl (NULL)
[riscv64] MI2a: maybe install (a direct target): openssl 3.5.4-alt1:sisyphus_riscv64+99925.200.1.1 at 1762591620
[riscv64] MI2a: target SELECTED: openssl 3.5.4-alt1:sisyphus_riscv64+99925.200.1.1 at 1762591620
[riscv64] MI2a: requesting to install openssl (unspec'd ver; inspect with Debug::pkgMark-shallow)
[riscv64] MI2a: marked for install (shallow): openssl
[riscv64] MI2a: satisfying Depends: libarrow-flight = 12.0.0-alt2.6:sisyphus_riscv64+96790.133700.18.1
[riscv64] MI2a: maybe install (a direct target): libarrow-flight 12.0.0-alt2.6:sisyphus_riscv64+96790.133700.18.1 at 1760888139
[riscv64] MI2a: target SELECTED: libarrow-flight 12.0.0-alt2.6:sisyphus_riscv64+96790.133700.18.1 at 1760888139
[riscv64] MI2a: requesting to install libarrow-flight (unspec'd ver; inspect with Debug::pkgMark-shallow)
[riscv64] MI2a: marked for install (shallow): libarrow-flight
[riscv64] MI2a: satisfying Depends: c-ares (NULL)
[riscv64] MI2a: maybe install (a direct target): c-ares 1.34.6-alt1:sisyphus_riscv64+103419.100.1.1 at 1765344127
[riscv64] MI2a: target SELECTED: c-ares 1.34.6-alt1:sisyphus_riscv64+103419.100.1.1 at 1765344127
[riscv64] MI2a: requesting to install c-ares (unspec'd ver; inspect with Debug::pkgMark-shallow)
[riscv64] MI2a: marked for install (shallow): c-ares
[riscv64] MI2a: satisfying Depends: libgpr.so.45()(64bit) >= set:ljGJ6Gr7zp9
[riscv64] MI2a: maybe install (a providing target): libgrpc 1.70.1-alt1.1:sisyphus_riscv64+88898.100.1.1 at 1752062341
[riscv64] MI2a: target SELECTED: libgrpc 1.70.1-alt1.1:sisyphus_riscv64+88898.100.1.1 at 1752062341
[riscv64] MI2a: requesting to install libgrpc (unspec'd ver; inspect with Debug::pkgMark-shallow)
[riscv64] MI2a: marked for install (shallow): libgrpc
[riscv64] MI2a: satisfying Depends: libprotobuf.so.25.5.0()(64bit) >= set:plRZBdRINBvNMouw3WMSGmKN8Re4M5UahhCkkkUp8suKQKvU
[riscv64] MI2a: maybe install (a providing target): libprotobuf25 3.25.5-alt7:sisyphus_riscv64+110252.100.1.1 at 1770824841
[riscv64] MI2a: target SELECTED: libprotobuf25 3.25.5-alt7:sisyphus_riscv64+110252.100.1.1 at 1770824841
[riscv64] MI2a: requesting to install libprotobuf25 (unspec'd ver; inspect with Debug::pkgMark-shallow)
[riscv64] MI2a: marked for install (shallow): libprotobuf25
[riscv64] MI2a: satisfying Depends: libgrpc++.so.1.70()(64bit) >= set:nhuAtaaP9USnkZsC0WkwZLD1wmXChO8sZrbEUkMpOcgEtxwa4VfpcfKOyTZ6oR3urcXLQs8br2Qg3Sm1oG2m3WPaUZ3ifW5NRN1EQo9EndICSHdCCM1elMbL597
[riscv64] MI2a: maybe install (a providing target): libgrpc++ 1.70.1-alt1.1:sisyphus_riscv64+88898.100.1.1 at 1752062341
[riscv64] MI2a: target SELECTED: libgrpc++ 1.70.1-alt1.1:sisyphus_riscv64+88898.100.1.1 at 1752062341
[riscv64] MI2a: requesting to install libgrpc++ (unspec'd ver; inspect with Debug::pkgMark-shallow)
[riscv64] MI2a: marked for install (shallow): libgrpc++
[riscv64] MI2a: satisfying Depends: python3(tlz) < 0
[riscv64] MI2a: maybe install (a providing target): python3-module-toolz 1.1.0-alt1:sisyphus_riscv64+108648.100.1.1 at 1769682667
[riscv64] MI2a: target SELECTED: python3-module-toolz 1.1.0-alt1:sisyphus_riscv64+108648.100.1.1 at 1769682667
[riscv64] MI2a: requesting to install python3-module-toolz (unspec'd ver; inspect with Debug::pkgMark-shallow)
[riscv64] MI2a: marked for install (shallow): python3-module-toolz
[riscv64] MI2a: satisfying Depends: python3(yaml) < 0
[riscv64] MI2a: maybe install (a providing target): python3-module-yaml 6.0.3-alt1:sisyphus_riscv64+97219.300.1.1 at 1761130484
[riscv64] MI2a: target SELECTED: python3-module-yaml 6.0.3-alt1:sisyphus_riscv64+97219.300.1.1 at 1761130484
[riscv64] MI2a: requesting to install python3-module-yaml (unspec'd ver; inspect with Debug::pkgMark-shallow)
[riscv64] MI2a: marked for install (shallow): python3-module-yaml
[riscv64] MI2a: satisfying Depends: libyaml-0.so.2()(64bit) >= set:jeDuSUAbEuz1xrY3muBZ56F9Jbi2W3kR6iB5oRQxGfDDGyazcKxJ4shcJWS8IVb7
[riscv64] MI2a: maybe install (a providing target): libyaml2 6.0.2-alt1:sisyphus_riscv64+93349.100.1.1 at 1756302205
[riscv64] MI2a: target SELECTED: libyaml2 6.0.2-alt1:sisyphus_riscv64+93349.100.1.1 at 1756302205
[riscv64] MI2a: requesting to install libyaml2 (unspec'd ver; inspect with Debug::pkgMark-shallow)
[riscv64] MI2a: marked for install (shallow): libyaml2
[riscv64] MI2a: satisfying Depends: python3(fuse) < 0
[riscv64] MI2a: maybe install (a providing target): python3-module-fuse 1.0.9-alt1:sisyphus_riscv64+96790.17300.4.1 at 1760252941
[riscv64] MI2a: target SELECTED: python3-module-fuse 1.0.9-alt1:sisyphus_riscv64+96790.17300.4.1 at 1760252941
[riscv64] MI2a: requesting to install python3-module-fuse (unspec'd ver; inspect with Debug::pkgMark-shallow)
[riscv64] MI2a: marked for install (shallow): python3-module-fuse
[riscv64] MI2a: satisfying Depends: libfuse.so.2()(64bit) >= set:lhaNABjx9GsGYDj3eoZFlhdf0
[riscv64] MI2a: maybe install (a providing target): libfuse 2.9.9-alt5:sisyphus_riscv64+73727.200.1.1 at 1740024049
[riscv64] MI2a: target SELECTED: libfuse 2.9.9-alt5:sisyphus_riscv64+73727.200.1.1 at 1740024049
[riscv64] MI2a: requesting to install libfuse (unspec'd ver; inspect with Debug::pkgMark-shallow)
[riscv64] MI2a: marked for install (shallow): libfuse
[riscv64] MI2a: satisfying Depends: python3(libarchive) < 0
[riscv64] MI2a: maybe install (a providing target): python3-module-libarchive-c 5.3-alt1.1:sisyphus_riscv64+116939.1100.1.2 at 1774872409
[riscv64] MI2a: target SELECTED: python3-module-libarchive-c 5.3-alt1.1:sisyphus_riscv64+116939.1100.1.2 at 1774872409
[riscv64] MI2a: requesting to install python3-module-libarchive-c (unspec'd ver; inspect with Debug::pkgMark-shallow)
[riscv64] MI2a: marked for install (shallow): python3-module-libarchive-c
[riscv64] MI2a: satisfying Depends: python3(paramiko) < 0
[riscv64] MI2a: maybe install (a providing target): python3-module-paramiko 4.0.0-alt1.1:sisyphus_riscv64+116930.100.1.1 at 1774848448
[riscv64] MI2a: target SELECTED: python3-module-paramiko 4.0.0-alt1.1:sisyphus_riscv64+116930.100.1.1 at 1774848448
[riscv64] MI2a: requesting to install python3-module-paramiko (unspec'd ver; inspect with Debug::pkgMark-shallow)
[riscv64] MI2a: marked for install (shallow): python3-module-paramiko
[riscv64] MI2a: satisfying Depends: python3(bcrypt) < 0
[riscv64] MI2a: maybe install (a providing target): python3-module-bcrypt 5.0.0-alt1:sisyphus_riscv64+116550.100.1.1 at 1774590264
[riscv64] MI2a: target SELECTED: python3-module-bcrypt 5.0.0-alt1:sisyphus_riscv64+116550.100.1.1 at 1774590264
[riscv64] MI2a: requesting to install python3-module-bcrypt (unspec'd ver; inspect with Debug::pkgMark-shallow)
[riscv64] MI2a: marked for install (shallow): python3-module-bcrypt
[riscv64] MI2a: satisfying Depends: python3(cryptography.exceptions) < 0
[riscv64] MI2a: maybe install (a providing target): python3-module-cryptography 46.0.7-alt1:sisyphus_riscv64+118365.200.1.1 at 1775729655
[riscv64] MI2a: target SELECTED: python3-module-cryptography 46.0.7-alt1:sisyphus_riscv64+118365.200.1.1 at 1775729655
[riscv64] MI2a: requesting to install python3-module-cryptography (unspec'd ver; inspect with Debug::pkgMark-shallow)
[riscv64] MI2a: marked for install (shallow): python3-module-cryptography
[riscv64] MI2a: satisfying Depends: python3(nacl.signing) < 0
[riscv64] MI2a: maybe install (a providing target): python3-module-pynacl 1.6.2-alt1:sisyphus_riscv64+109389.100.1.1 at 1770349475
[riscv64] MI2a: target SELECTED: python3-module-pynacl 1.6.2-alt1:sisyphus_riscv64+109389.100.1.1 at 1770349475
[riscv64] MI2a: requesting to install python3-module-pynacl (unspec'd ver; inspect with Debug::pkgMark-shallow)
[riscv64] MI2a: marked for install (shallow): python3-module-pynacl
[riscv64] MI2a: satisfying Depends: libsodium.so.26()(64bit) >= set:nf9qo5nfS4c4Z9uebwg21Vc55D935n6iZdIgb8yo6QdOtPm3APaZsXAIZu58pPJbqgBklKnckavRsWZcsuOGSmqG1VyNITfgnkc2t7tLLEGi0cQCYm8Cl7PNrit6w5sNmp8to5bbDSkEv3EgZaaupCbe1ZtXbEpPJt5XigxVBaub5qs6lH15KyHUZdJZjSLZGZeUPKYi0XsPUAPm5LcMCZ2h8ONIGOGCC2ogOUzMaPoyQOQVJIHaVh1ZHegRYPFvlyolJt4mzOyc2zs6jlIs8OPZlUQe7geNK9pAzSoPyr0DLZwNxJtLoMS7OzXJfw91pHMUEnCKPatxu3ZbU8xAuiSUoYd9hWWSU3v8xZxRkD6E4bciXZqoK7KWtvWmD7hh8Q20Q73rKZsYAlZCQKz61sssOvpBUNRRBemZ8S26OcsyOcv5wR4Hrj7gvDZhWrj5ES742XfsByVDBXX8sdHZ3aneGWmztTxQI5davYhT9mDai51FzIngoQgsFfykubF8qi4ferVz73wmpEA7PlGkwWuk1wcfuQTk0
[riscv64] MI2a: maybe install (a providing target): libsodium26 1.0.21-alt2:sisyphus_riscv64+118693.100.1.1 at 1776154151
[riscv64] MI2a: target SELECTED: libsodium26 1.0.21-alt2:sisyphus_riscv64+118693.100.1.1 at 1776154151
[riscv64] MI2a: requesting to install libsodium26 (unspec'd ver; inspect with Debug::pkgMark-shallow)
[riscv64] MI2a: marked for install (shallow): libsodium26
[riscv64] Selecting libmysqlclient21-devel for 'libMySQL-devel'
[riscv64] rpm-macros-cmake is already the newest version.
[riscv64] rpm-build-python3 is already the newest version.
[riscv64] Selecting python3-dev for 'python3-devel'
[riscv64] Selecting ocl-icd-devel for 'pkgconfig(OpenCL)'
[riscv64] E: Couldn't find package python3-module-myst_nb
[riscv64] hsh-install: Failed to calculate package file list.
[riscv64] hsh-install: Failed to generate package file list.
2026-May-08 06:17:41 :: [riscv64] gdal-3.12.4-alt1.src.rpm: remote: cannot build src.rpm
2026-May-08 06:17:41 :: [riscv64] #100 gdal-3.12.4-alt1.src.rpm: build FAILED
2026-May-08 06:17:41 :: [riscv64] requesting cancellation of task processing
2026-May-08 06:17:42 :: [riscv64] build FAILED
2026-May-08 06:17:42 :: task #120598 for sisyphus_riscv64 FAILED
More information about the Riscv-reports
mailing list