[riscv-reports] [#120350] sisyphus_riscv64 FAILED srpm=sessions-0.1.17-alt1.src.rpm
Girar sisyphus_riscv64 awaiter recycler
noreply at basealt.ru
Thu May 7 20:58:26 MSK 2026
http://web.build.srt.basealt.ru/tasks/120350/logs/events.1.1.log
subtask name riscv64
#100 sessions failed
2026-May-07 17:53:59 :: shared task #120350 for sisyphus_riscv64 started by recycler:
2026-May-07 17:53:59 :: message: sync
#100 build sessions-0.1.17-alt1.src.rpm
2026-May-07 17:54:06 :: [riscv64] #100 sessions-0.1.17-alt1.src.rpm: build start
[riscv64] packagefile github.com/rymdport/portal/internal/apis=/usr/src/tmp/go-build1047290623/b117/_pkg_.a
[riscv64] packagefile github.com/rymdport/portal/internal/convert=/usr/src/tmp/go-build1047290623/b118/_pkg_.a
[riscv64] packagefile github.com/rymdport/portal/internal/request=/usr/src/tmp/go-build1047290623/b119/_pkg_.a
[riscv64] EOF
[riscv64] /usr/lib/golang/pkg/tool/linux_riscv64/compile -o $WORK/b102/_pkg_.a -trimpath "$WORK/b102=>" -p github.com/rymdport/portal/background -lang=go1.19 -complete -buildid C0RG4P3-H0GER2f5nNxR/C0RG4P3-H0GER2f5nNxR -goversion go1.26.2-X:nodwarf5 -c=64 -nolocalimports -importcfg $WORK/b102/importcfg -pack ./vendor/github.com/rymdport/portal/background/background.go ./vendor/github.com/rymdport/portal/background/request.go ./vendor/github.com/rymdport/portal/background/status.go
[riscv64] go tool buildid -w $WORK/b102/_pkg_.a # internal
[riscv64] cp $WORK/b102/_pkg_.a /usr/src/.cache/go-build/71/71338e4116b31546a6b49a9546af3353bcc36be6656f1d346c33d9eee96cbb81-d # internal
[riscv64] error: Bad exit status from /usr/src/tmp/rpm-tmp.32871 (%build)
[riscv64] RPM build errors:
[riscv64] File /usr/src/RPM/SOURCES/sessions-0.1.17-alt.patch is smaller than 8 bytes
2026-May-07 17:58:26 :: [riscv64] sessions-0.1.17-alt1.src.rpm: remote: build failed
2026-May-07 17:58:26 :: [riscv64] #100 sessions-0.1.17-alt1.src.rpm: build FAILED
2026-May-07 17:58:26 :: [riscv64] requesting cancellation of task processing
2026-May-07 17:58:26 :: [riscv64] build FAILED
2026-May-07 17:58:26 :: task #120350 for sisyphus_riscv64 FAILED
More information about the Riscv-reports
mailing list