[riscv-reports] [#124608] [test-only] sisyphus_riscv64 FAILED kernel-image.git=k1x-6.6.63-alt1.port.rv64

Girar sisyphus_riscv64 awaiter l27001 noreply at basealt.ru
Thu May 7 18:03:04 MSK 2026


http://web.build.srt.basealt.ru/tasks/124608/logs/events.1.1.log

subtask  name          riscv64
   #100  kernel-image   failed

2026-May-07 14:22:49 :: test-only task #124608 for sisyphus_riscv64 started by l27001:
#100 build k1x-6.6.63-alt1.port.rv64 from /people/l27001/packages/kernel-image.git fetched at 2026-May-07 14:16:24
2026-May-07 14:22:56 :: [riscv64] #100 kernel-image.git k1x-6.6.63-alt1.port.rv64: build start
[riscv64] Processing files: kernel-image-k1x-6.6.63-alt1.port.rv64
[riscv64] error: No such file or directory: /usr/src/tmp/kernel-image-k1x-buildroot/lib/modules/6.6.63-k1x-alt1.port.rv64/kernel/drivers/accel
[riscv64] error: No such file or directory: /usr/src/tmp/kernel-image-k1x-buildroot/lib/modules/6.6.63-k1x-alt1.port.rv64/kernel/drivers/media
[riscv64] error: File not found by glob: /usr/src/tmp/kernel-image-k1x-buildroot/lib/modules/6.6.63-k1x-alt1.port.rv64/kernel/drivers/usb/typec/altmodes/typec_displayport.ko*
[riscv64] error: File not found by glob: /usr/src/tmp/kernel-image-k1x-buildroot/lib/modules/6.6.63-k1x-alt1.port.rv64/kernel/drivers/usb/typec/altmodes/typec_nvidia.ko*
[riscv64] error: File not found by glob: /usr/src/tmp/kernel-image-k1x-buildroot/lib/modules/6.6.63-k1x-alt1.port.rv64/kernel/drivers/usb/gadget/function/usb_f_uvc.ko*
[riscv64] RPM build errors:
[riscv64]     No such file or directory: /usr/src/tmp/kernel-image-k1x-buildroot/lib/modules/6.6.63-k1x-alt1.port.rv64/kernel/drivers/accel
[riscv64]     No such file or directory: /usr/src/tmp/kernel-image-k1x-buildroot/lib/modules/6.6.63-k1x-alt1.port.rv64/kernel/drivers/media
[riscv64]     File not found by glob: /usr/src/tmp/kernel-image-k1x-buildroot/lib/modules/6.6.63-k1x-alt1.port.rv64/kernel/drivers/usb/typec/altmodes/typec_displayport.ko*
2026-May-07 15:03:04 :: [riscv64] kernel-image.git k1x-6.6.63-alt1.port.rv64: remote: build failed
2026-May-07 15:03:04 :: [riscv64] #100 kernel-image.git k1x-6.6.63-alt1.port.rv64: build FAILED
2026-May-07 15:03:04 :: [riscv64] requesting cancellation of task processing
2026-May-07 15:03:04 :: [riscv64] build FAILED
2026-May-07 15:03:04 :: task #124608 for sisyphus_riscv64 FAILED


More information about the Riscv-reports mailing list