[riscv-reports] [#124593] [test-only] sisyphus_riscv64 FAILED kernel-image.git=k1x-6.6.63-alt1.port.rv64
Girar sisyphus_riscv64 awaiter l27001
noreply at basealt.ru
Thu May 7 16:16:01 MSK 2026
http://web.build.srt.basealt.ru/tasks/124593/logs/events.1.1.log
subtask name riscv64
#100 kernel-image failed
2026-May-07 13:12:23 :: test-only task #124593 for sisyphus_riscv64 started by l27001:
#100 build k1x-6.6.63-alt1.port.rv64 from /people/l27001/packages/kernel-image.git fetched at 2026-May-07 13:06:42
2026-May-07 13:12:29 :: [riscv64] #100 kernel-image.git k1x-6.6.63-alt1.port.rv64: build start
[riscv64] /usr/src/in/srpm/kernel-image-k1x-6.6.63-alt1.port.rv64.src.rpm: wrong CHANGELOGNAME: expected "6.6.63-alt1.port.rv64", found ""
[riscv64] sisyphus_check: check-changelog ERROR: changelog format violation
[riscv64] hsh-rebuild: kernel-image-k1x-6.6.63-alt1.port.rv64.src.rpm: sisyphus_check failed.
2026-May-07 13:16:00 :: [riscv64] kernel-image.git k1x-6.6.63-alt1.port.rv64: remote: build failed
2026-May-07 13:16:00 :: [riscv64] #100 kernel-image.git k1x-6.6.63-alt1.port.rv64: build FAILED
2026-May-07 13:16:00 :: [riscv64] requesting cancellation of task processing
2026-May-07 13:16:01 :: [riscv64] build FAILED
2026-May-07 13:16:01 :: task #124593 for sisyphus_riscv64 FAILED
More information about the Riscv-reports
mailing list