[riscv-reports] [#120293] sisyphus_riscv64 FAILED srpm=freeipa-4.13.1-alt5.src.rpm
Girar sisyphus_riscv64 awaiter recycler
noreply at basealt.ru
Thu May 7 15:42:34 MSK 2026
http://web.build.srt.basealt.ru/tasks/120293/logs/events.1.1.log
subtask name riscv64
#100 freeipa failed
2026-May-07 12:34:34 :: shared task #120293 for sisyphus_riscv64 started by recycler:
2026-May-07 12:34:34 :: message: sync
#100 build freeipa-4.13.1-alt5.src.rpm
2026-May-07 12:34:45 :: [riscv64] #100 freeipa-4.13.1-alt5.src.rpm: build start
[riscv64] throw new Error(
[riscv64] Error: Cannot find module @rollup/rollup-linux-riscv64-gnu. npm has a bug related to optional dependencies (https://github.com/npm/cli/issues/4828). Please try `npm i` again after removing both package-lock.json and node_modules directory.
[riscv64] at requireWithFriendlyError (/usr/src/RPM/BUILD/freeipa-4.13.1/install/freeipa-webui/node_modules/rollup/dist/native.js:64:9)
[riscv64] --
[riscv64] at ModuleWrap.<anonymous> (node:internal/modules/esm/translators:202:7) {
[riscv64] [cause]: Error: Cannot find module '@rollup/rollup-linux-riscv64-gnu'
[riscv64] Require stack:
2026-May-07 12:42:19 :: [riscv64] freeipa-4.13.1-alt5.src.rpm: remote: build failed
2026-May-07 12:42:19 :: [riscv64] #100 freeipa-4.13.1-alt5.src.rpm: build FAILED
2026-May-07 12:42:19 :: [riscv64] requesting cancellation of task processing
2026-May-07 12:42:34 :: [riscv64] build FAILED
2026-May-07 12:42:34 :: task #120293 for sisyphus_riscv64 FAILED
More information about the Riscv-reports
mailing list