[riscv-reports] [#120279] sisyphus_riscv64 FAILED srpm=python3-module-build-1.4.4-alt1.src.rpm

Girar sisyphus_riscv64 awaiter recycler noreply at basealt.ru
Thu May 7 14:25:27 MSK 2026


http://web.build.srt.basealt.ru/tasks/120279/logs/events.1.1.log

subtask  name                  riscv64
   #100  python3-module-build   failed

2026-May-07 11:18:12 :: shared task #120279 for sisyphus_riscv64 started by recycler:
2026-May-07 11:18:12 :: message: sync
#100 build python3-module-build-1.4.4-alt1.src.rpm
2026-May-07 11:18:15 :: [riscv64] #100 python3-module-build-1.4.4-alt1.src.rpm: build start
[riscv64] >           assert env._env_backend.display_name == env_backend_display_name
[riscv64] E           AssertionError: assert 'venv+pip' == 'virtualenv+pip'
[riscv64] E             
[riscv64] --
[riscv64] SKIPPED [1] tests/test_integration.py: integration tests not run (no --run-integration flag)
[riscv64] FAILED tests/test_env.py::test_venv_creation[pip-virtualenv+pip-None] - Asser...
[riscv64] ===== 1 failed, 182 passed, 3 skipped, 60 deselected in 244.22s (0:04:04) ======
[riscv64] INFO     : Command's result: FAILURE
[riscv64] INFO     : Command's error: Command '['python3', '-m', 'pytest', '-vra', '-m', 'not network']' returned non-zero exit status 1.
[riscv64] error: Bad exit status from /usr/src/tmp/rpm-tmp.28383 (%check)
2026-May-07 11:25:26 :: [riscv64] python3-module-build-1.4.4-alt1.src.rpm: remote: build failed
2026-May-07 11:25:26 :: [riscv64] #100 python3-module-build-1.4.4-alt1.src.rpm: build FAILED
2026-May-07 11:25:26 :: [riscv64] requesting cancellation of task processing
2026-May-07 11:25:27 :: [riscv64] build FAILED
2026-May-07 11:25:27 :: task #120279 for sisyphus_riscv64 FAILED


More information about the Riscv-reports mailing list