[riscv-reports] [#124557] [test-only] sisyphus_riscv64 FAILED kernel-image.git=6.6.63-alt1.port.rv64

Girar sisyphus_riscv64 awaiter l27001 noreply at basealt.ru
Thu May 7 13:43:14 MSK 2026


http://web.build.srt.basealt.ru/tasks/124557/logs/events.1.1.log

subtask  name          riscv64
   #100  kernel-image   failed

2026-May-07 10:10:46 :: test-only task #124557 for sisyphus_riscv64 started by l27001:
#100 build 6.6.63-alt1.port.rv64 from /people/l27001/packages/kernel-image.git fetched at 2026-May-07 10:09:26
2026-May-07 10:10:51 :: [riscv64] #100 kernel-image.git 6.6.63-alt1.port.rv64: build start
[riscv64] + mv /usr/src/tmp/kernel-image-k1x-buildroot/lib/modules/6.6.63-k1x-alt1.port.rv64/kernel/drivers/media/common/videobuf2/ /usr/src/tmp/kernel-image-k1x-buildroot/lib/modules/6.6.63-k1x-alt1.port.rv64/kernel/drivers/media-core/
[riscv64] mv: cannot stat '/usr/src/tmp/kernel-image-k1x-buildroot/lib/modules/6.6.63-k1x-alt1.port.rv64/kernel/drivers/media/common/videobuf2/': No such file or directory
2026-May-07 10:43:13 :: [riscv64] kernel-image.git 6.6.63-alt1.port.rv64: remote: build failed
2026-May-07 10:43:13 :: [riscv64] #100 kernel-image.git 6.6.63-alt1.port.rv64: build FAILED
2026-May-07 10:43:13 :: [riscv64] requesting cancellation of task processing
2026-May-07 10:43:14 :: [riscv64] build FAILED
2026-May-07 10:43:14 :: task #124557 for sisyphus_riscv64 FAILED


More information about the Riscv-reports mailing list