[riscv-reports] [#120273] sisyphus_riscv64 FAILED srpm=abcmidi-2026.02.24-alt2.src.rpm ...
Girar sisyphus_riscv64 awaiter recycler
noreply at basealt.ru
Thu May 7 13:42:00 MSK 2026
http://web.build.srt.basealt.ru/tasks/120273/logs/events.1.1.log
subtask name riscv64
#100 abcmidi 2:47
#200 airspyone-host 2:54
#300 ayatana-indicator-printers 4:00
#400 gxcapindicator 2:48
#500 limesuite 15:50
#600 remake 7:58
#700 waylogout failed
2026-May-07 10:02:19 :: shared task #120273 for sisyphus_riscv64 started by recycler:
2026-May-07 10:02:19 :: message: sync
#100 build abcmidi-2026.02.24-alt2.src.rpm
#200 build airspyone-host-1.0.10-alt3.src.rpm
#300 build ayatana-indicator-printers-23.10.1-alt2.src.rpm
#400 build gxcapindicator-1.2-alt3.src.rpm
#500 build limesuite-23.11.0-alt3.src.rpm
#600 build remake-4.3+dbg1.6-alt3.src.rpm
#700 build waylogout-0.3-alt2.src.rpm
#1000 build xli-1.17.0-alt12.src.rpm
#1100 build iconoscope-0.9.9-alt3.src.rpm
#1200 build stickynotes-1.1-alt3.src.rpm
2026-May-07 10:02:19 :: created build repo
2026-May-07 10:02:24 :: [riscv64] #100 abcmidi-2026.02.24-alt2.src.rpm: build start
2026-May-07 10:05:11 :: [riscv64] #100 abcmidi-2026.02.24-alt2.src.rpm: build OK
2026-May-07 10:05:11 :: [riscv64] #200 airspyone-host-1.0.10-alt3.src.rpm: build start
2026-May-07 10:08:05 :: [riscv64] #200 airspyone-host-1.0.10-alt3.src.rpm: build OK
2026-May-07 10:08:05 :: [riscv64] #300 ayatana-indicator-printers-23.10.1-alt2.src.rpm: build start
2026-May-07 10:12:05 :: [riscv64] #300 ayatana-indicator-printers-23.10.1-alt2.src.rpm: build OK
2026-May-07 10:12:05 :: [riscv64] #400 gxcapindicator-1.2-alt3.src.rpm: build start
2026-May-07 10:14:53 :: [riscv64] #400 gxcapindicator-1.2-alt3.src.rpm: build OK
2026-May-07 10:14:53 :: [riscv64] #500 limesuite-23.11.0-alt3.src.rpm: build start
2026-May-07 10:30:43 :: [riscv64] #500 limesuite-23.11.0-alt3.src.rpm: build OK
2026-May-07 10:30:43 :: [riscv64] #600 remake-4.3+dbg1.6-alt3.src.rpm: build start
2026-May-07 10:38:41 :: [riscv64] #600 remake-4.3+dbg1.6-alt3.src.rpm: build OK
2026-May-07 10:38:41 :: [riscv64] #700 waylogout-0.3-alt2.src.rpm: build start
[riscv64] <13>May 7 10:41:49 rpmi: rpm-macros-meson-1.11.1-alt1 sisyphus_riscv64+119971.100.1.1 1778105513 installed
[riscv64] Reading Package Lists...
[riscv64] Building Dependency Tree...
[riscv64] MI2a: marked for install (shallow): meson
[riscv64] MI2a: satisfying Depends: python3 >= 3.7
[riscv64] MI2a: maybe install (a direct target): python3 3.13.12-alt3:sisyphus_riscv64+119616.100.1.1 at 1776677221
[riscv64] MI2a: target SELECTED: python3 3.13.12-alt3:sisyphus_riscv64+119616.100.1.1 at 1776677221
[riscv64] MI2a: requesting to install python3 (unspec'd ver; inspect with Debug::pkgMark-shallow)
[riscv64] MI2a: marked for install (shallow): python3
[riscv64] MI2a: satisfying Depends: python3-base = 3.13.12-alt3:sisyphus_riscv64+119616.100.1.1
[riscv64] MI2a: maybe install (a direct target): python3-base 3.13.12-alt3:sisyphus_riscv64+119616.100.1.1 at 1776677221
[riscv64] MI2a: target SELECTED: python3-base 3.13.12-alt3:sisyphus_riscv64+119616.100.1.1 at 1776677221
[riscv64] MI2a: requesting to install python3-base (unspec'd ver; inspect with Debug::pkgMark-shallow)
[riscv64] MI2a: marked for install (shallow): python3-base
[riscv64] MI2a: satisfying Depends: libb2.so.1()(64bit) >= set:ifZigOjACtTxPlFd1
[riscv64] MI2a: maybe install (a providing target): libb2 0.98.1-alt1_1:sisyphus_riscv64+13721.100.1.1 at 1638969645
[riscv64] MI2a: target SELECTED: libb2 0.98.1-alt1_1:sisyphus_riscv64+13721.100.1.1 at 1638969645
[riscv64] MI2a: requesting to install libb2 (unspec'd ver; inspect with Debug::pkgMark-shallow)
[riscv64] MI2a: marked for install (shallow): libb2
[riscv64] MI2a: satisfying Depends: libcrypto.so.3()(64bit) >= set:qjvVyozNavZkZ83WeaDscZzHMrdOZJigtBCBJQvrqD5XYvQVKvoQdMyuy5DglZ0g5OwZmoOe8cvPBvDA6cBvaLWgaBpxJxOiy4PQ61VPZubMZ3n8rmRNMs2wGn4RSjR0c9c1A5eS6d1tOqiG9fzsbR8cS3oOKtZJvgseGSsbtRZilsSSEN1DRb8gDv8fs3HcU8gF3WlVBWjlExhbKgbtaz1KLt7XKJ5D27JXgtZ18MDZrMTmWy25HHepmFdZbkAygEPDwRvxzPyZBmPS5XYMzjL86Z0pJFiplzFx6tF6wQvPLdyZgdGvD1cZIWIi5nfbJkemlrMfEFmQM4YZIeeCR9XiCDyZKAul7zQ0U5LnsQX904K77cGZDYYy4RtH0
[riscv64] MI2a: maybe install (a providing target): libcrypto3 3.5.4-alt1:sisyphus_riscv64+99925.200.1.1 at 1762591620
[riscv64] MI2a: target SELECTED: libcrypto3 3.5.4-alt1:sisyphus_riscv64+99925.200.1.1 at 1762591620
[riscv64] MI2a: requesting to install libcrypto3 (unspec'd ver; inspect with Debug::pkgMark-shallow)
[riscv64] MI2a: marked for install (shallow): libcrypto3
[riscv64] MI2a: satisfying Depends: openssl-config >= 3.2.0-alt1
[riscv64] MI2a: maybe install (a direct target): openssl-config 3.5.0-alt1:sisyphus_riscv64+99925.100.1.1 at 1762587030
[riscv64] MI2a: target SELECTED: openssl-config 3.5.0-alt1:sisyphus_riscv64+99925.100.1.1 at 1762587030
[riscv64] MI2a: requesting to install openssl-config (unspec'd ver; inspect with Debug::pkgMark-shallow)
[riscv64] MI2a: marked for install (shallow): openssl-config
[riscv64] MI2a: satisfying Depends: ca-certificates (NULL)
[riscv64] MI2a: maybe install (a direct target): ca-certificates 2026.02.25-alt1:sisyphus_riscv64+111964.200.1.1 at 1772057912
[riscv64] MI2a: target SELECTED: ca-certificates 2026.02.25-alt1:sisyphus_riscv64+111964.200.1.1 at 1772057912
[riscv64] MI2a: requesting to install ca-certificates (unspec'd ver; inspect with Debug::pkgMark-shallow)
[riscv64] MI2a: marked for install (shallow): ca-certificates
[riscv64] MI2a: satisfying Depends: ca-trust (NULL)
[riscv64] MI2a: maybe install (a direct target): ca-trust 0.2.0-alt1:sisyphus_riscv64+47419.100.1.1 at 1712764300
[riscv64] MI2a: target SELECTED: ca-trust 0.2.0-alt1:sisyphus_riscv64+47419.100.1.1 at 1712764300
[riscv64] MI2a: requesting to install ca-trust (unspec'd ver; inspect with Debug::pkgMark-shallow)
[riscv64] MI2a: marked for install (shallow): ca-trust
[riscv64] MI2a: satisfying Depends: p11-kit-trust (NULL)
[riscv64] MI2a: maybe install (a direct target): p11-kit-trust 1:0.25.10-alt2:sisyphus_riscv64+102359.300.1.2 at 1764647411
[riscv64] MI2a: target SELECTED: p11-kit-trust 1:0.25.10-alt2:sisyphus_riscv64+102359.300.1.2 at 1764647411
[riscv64] MI2a: requesting to install p11-kit-trust (unspec'd ver; inspect with Debug::pkgMark-shallow)
[riscv64] MI2a: marked for install (shallow): p11-kit-trust
[riscv64] MI2a: satisfying Depends: /etc/alternatives/packages.d (NULL)
[riscv64] MI2a: maybe install (a providing target): alternatives 0.5.3-alt1:sisyphus_riscv64+71244.100.1.1 at 1738025117
[riscv64] MI2a: target SELECTED: alternatives 0.5.3-alt1:sisyphus_riscv64+71244.100.1.1 at 1738025117
[riscv64] MI2a: requesting to install alternatives (unspec'd ver; inspect with Debug::pkgMark-shallow)
[riscv64] MI2a: marked for install (shallow): alternatives
[riscv64] MI2a: satisfying Depends: rpm-macros-alternatives = 0.5.3-alt1:sisyphus_riscv64+71244.100.1.1
[riscv64] MI2a: maybe install (a direct target): rpm-macros-alternatives 0.5.3-alt1:sisyphus_riscv64+71244.100.1.1 at 1738025117
[riscv64] MI2a: target SELECTED: rpm-macros-alternatives 0.5.3-alt1:sisyphus_riscv64+71244.100.1.1 at 1738025117
[riscv64] MI2a: requesting to install rpm-macros-alternatives (unspec'd ver; inspect with Debug::pkgMark-shallow)
[riscv64] MI2a: marked for install (shallow): rpm-macros-alternatives
[riscv64] MI2a: satisfying Depends: libtasn1.so.6()(64bit) >= set:jfRaXblmF8mf5SLNNXDA2CDacDxCZqQOspDh1
[riscv64] MI2a: maybe install (a providing target): libtasn1 4.21.0-alt1:sisyphus_riscv64+110145.100.1.1 at 1770759719
[riscv64] MI2a: target SELECTED: libtasn1 4.21.0-alt1:sisyphus_riscv64+110145.100.1.1 at 1770759719
[riscv64] MI2a: requesting to install libtasn1 (unspec'd ver; inspect with Debug::pkgMark-shallow)
[riscv64] MI2a: marked for install (shallow): libtasn1
[riscv64] MI2a: satisfying Depends: libp11-kit = 1:0.25.10-alt2:sisyphus_riscv64+102359.300.1.2
[riscv64] MI2a: maybe install (a direct target): libp11-kit 1:0.25.10-alt2:sisyphus_riscv64+102359.300.1.2 at 1764647411
[riscv64] MI2a: target SELECTED: libp11-kit 1:0.25.10-alt2:sisyphus_riscv64+102359.300.1.2 at 1764647411
[riscv64] MI2a: requesting to install libp11-kit (unspec'd ver; inspect with Debug::pkgMark-shallow)
[riscv64] MI2a: marked for install (shallow): libp11-kit
[riscv64] MI2a: satisfying Depends: libexpat.so.1()(64bit) >= set:keKUFskiAdHdlMZeEkieMGaBXzzqkTENzrMVrULHLeDSf3zhdTBZ5OFCUEpIrnbsGoJY0PfVkj7DT11WUO5d0ZFjaYBPnv4YujEVhgTZDgrwOu6Gxfus72
[riscv64] MI2a: maybe install (a providing target): libexpat 2.7.4-alt1:sisyphus_riscv64+109313.100.1.1 at 1770323898
[riscv64] MI2a: target SELECTED: libexpat 2.7.4-alt1:sisyphus_riscv64+109313.100.1.1 at 1770323898
[riscv64] MI2a: requesting to install libexpat (unspec'd ver; inspect with Debug::pkgMark-shallow)
[riscv64] MI2a: marked for install (shallow): libexpat
[riscv64] MI2a: satisfying Depends: libmpdec.so.3()(64bit) >= set:mfKMM5WSnhLDPZvFmnT3UZzrmq8c8YrwNbOV4tWrYtxVLhVcTOCZFhcz3lEuvZcwi6sdFMWQoYneheybZqoHPamXBDDj1tDvOSZufCNoCdhGIsFsMAjgDRP3aaYZo365djtoYzTFzMebqqvYejutWDL4iBFP4DZFz95ekTiFkNlEgOfZbzZAVw77cJS8N8NLq7Xj1XrYJOufSLenVyExgbjfSYF9OtF8u2gC6g0GdyiHcFO9CztZ9gC7OBZzxibA5aSk7Oeqpq1
[riscv64] MI2a: maybe install (a providing target): libmpdec3 2.5.1-alt3:sisyphus_riscv64+29035.100.1.1 at 1675621702
[riscv64] MI2a: target SELECTED: libmpdec3 2.5.1-alt3:sisyphus_riscv64+29035.100.1.1 at 1675621702
[riscv64] MI2a: requesting to install libmpdec3 (unspec'd ver; inspect with Debug::pkgMark-shallow)
[riscv64] MI2a: marked for install (shallow): libmpdec3
[riscv64] MI2a: satisfying Depends: libssl.so.3()(64bit) >= set:ngBOW1d2ZbyFSsiZvpkX0aRzeV17bAT5EaRCZmKW9X2fa0f27wKZ65iyUBcgdmr2Qw7VpPMCSLCgiX1nS1zpZi4EsyIouzkvggkr76NBjuJQHeBaZqjGkNQQfJqfqowXNFX2ZBe5u6n9CSQheVQEnAqZLEDIF5ZhA6vwsjLZxdZqCsZvacbZ4MpdZKV6VkarM4cUZANB62kuvu1iRuPzv0RT6JZpPJRMYoZoDhv30TnoWXbmMkkRksjebiXUtEfu
[riscv64] MI2a: maybe install (a providing target): libssl3 3.5.4-alt1:sisyphus_riscv64+99925.200.1.1 at 1762591620
[riscv64] MI2a: target SELECTED: libssl3 3.5.4-alt1:sisyphus_riscv64+99925.200.1.1 at 1762591620
[riscv64] MI2a: requesting to install libssl3 (unspec'd ver; inspect with Debug::pkgMark-shallow)
[riscv64] MI2a: marked for install (shallow): libssl3
[riscv64] MI2a: satisfying Depends: python3-modules-sqlite3 = 3.13.12-alt3:sisyphus_riscv64+119616.100.1.1
[riscv64] MI2a: maybe install (a direct target): python3-modules-sqlite3 3.13.12-alt3:sisyphus_riscv64+119616.100.1.1 at 1776677221
[riscv64] MI2a: target SELECTED: python3-modules-sqlite3 3.13.12-alt3:sisyphus_riscv64+119616.100.1.1 at 1776677221
[riscv64] MI2a: requesting to install python3-modules-sqlite3 (unspec'd ver; inspect with Debug::pkgMark-shallow)
[riscv64] MI2a: marked for install (shallow): python3-modules-sqlite3
[riscv64] MI2a: satisfying Depends: libsqlite3.so.0()(64bit) >= set:ohbW8uvwE0AySekmaizOFVAhtivtNj465Jaq1eneiLkv5Zv1LNVfHZFHuxdfznlvQ6qFPOGr0BZgAYmNNAZ2ZBPTSkuF0mzrMkl5Ij9YNWuED7Z9yvson6PPpZ3zycc1kzO5dAvwHEkDSA5ypbpPHIJ4qnUkDNWE1r6PgU03Aopfq8rEm5VerLy2bAh2TRZndZHkVj6BmAIO0lgvfjUrVDeSU6RW1cmcROprdYM9HxIZ50
[riscv64] MI2a: maybe install (a providing target): libsqlite3 3.50.4-alt1:sisyphus_riscv64+91443.100.1.1 at 1754555936
[riscv64] MI2a: target SELECTED: libsqlite3 3.50.4-alt1:sisyphus_riscv64+91443.100.1.1 at 1754555936
[riscv64] MI2a: requesting to install libsqlite3 (unspec'd ver; inspect with Debug::pkgMark-shallow)
[riscv64] MI2a: marked for install (shallow): libsqlite3
[riscv64] MI2a: satisfying Depends: ninja-build >= 1.7
[riscv64] MI2a: maybe install (a direct target): ninja-build 1:1.13.2-alt1:sisyphus_riscv64+101409.100.1.1 at 1763805654
[riscv64] MI2a: target SELECTED: ninja-build 1:1.13.2-alt1:sisyphus_riscv64+101409.100.1.1 at 1763805654
[riscv64] MI2a: requesting to install ninja-build (unspec'd ver; inspect with Debug::pkgMark-shallow)
[riscv64] MI2a: marked for install (shallow): ninja-build
[riscv64] MI2a: satisfying Depends: python3(typing_extensions) < 0
[riscv64] MI2a: maybe install (a providing target): python3-module-typing_extensions 4.15.0-alt2:sisyphus_riscv64+100533.100.1.1 at 1763069395
[riscv64] MI2a: target SELECTED: python3-module-typing_extensions 4.15.0-alt2:sisyphus_riscv64+100533.100.1.1 at 1763069395
[riscv64] MI2a: requesting to install python3-module-typing_extensions (unspec'd ver; inspect with Debug::pkgMark-shallow)
[riscv64] MI2a: marked for install (shallow): python3-module-typing_extensions
[riscv64] MI2a: marked for install (shallow): cmake
[riscv64] MI2a: satisfying Depends: rpm-macros-cmake (NULL)
[riscv64] MI2a: maybe install (a direct target): rpm-macros-cmake 4.0.0-alt1:sisyphus_riscv64+79196.100.1.1 at 1744049311
[riscv64] MI2a: target SELECTED: rpm-macros-cmake 4.0.0-alt1:sisyphus_riscv64+79196.100.1.1 at 1744049311
[riscv64] MI2a: requesting to install rpm-macros-cmake (unspec'd ver; inspect with Debug::pkgMark-shallow)
[riscv64] MI2a: marked for install (shallow): rpm-macros-cmake
[riscv64] MI2a: satisfying Depends: libarchive.so.13()(64bit) >= set:mfws0SCfLRvPUKXi0gkbE0yqsuzVMI88jwJ7kSDXXM11MUSPfvqwmDm2xDogNmeEkAorJTlC2B1ZatQqH4cJ32OndcAjazDxDaNvG6mMdDQthrMI5Ie5skSvbnLedY5O95MlUcFQ1thxqvQWyDvIECoveyzf0x7I3xw6vu1
[riscv64] MI2a: maybe install (a providing target): libarchive13 3.8.5-alt1:sisyphus_riscv64+110011.100.1.1 at 1770695518
[riscv64] MI2a: target SELECTED: libarchive13 3.8.5-alt1:sisyphus_riscv64+110011.100.1.1 at 1770695518
[riscv64] MI2a: requesting to install libarchive13 (unspec'd ver; inspect with Debug::pkgMark-shallow)
[riscv64] MI2a: marked for install (shallow): libarchive13
[riscv64] MI2a: satisfying Depends: libxml2.so.16()(64bit) >= set:ojfKIRzCUl1DlIWJ6bZyMtibyxyGZBJ2VI9qoedfPopZpT3BKboL3cLZ1aQEap2l9LYNEi9OgBwi6PyZC
[riscv64] MI2a: maybe install (a providing target): libxml2_16 1:2.14.6-alt3:sisyphus_riscv64+112566.100.1.1 at 1772465777
[riscv64] MI2a: target SELECTED: libxml2_16 1:2.14.6-alt3:sisyphus_riscv64+112566.100.1.1 at 1772465777
[riscv64] MI2a: requesting to install libxml2_16 (unspec'd ver; inspect with Debug::pkgMark-shallow)
[riscv64] MI2a: marked for install (shallow): libxml2_16
[riscv64] MI2a: satisfying Depends: libcurl.so.4()(64bit) >= set:kgZtdjewuBSOM3YXjuKGePG56ZAe
[riscv64] MI2a: maybe install (a providing target): libcurl 8.19.0-alt1:sisyphus_riscv64+114193.100.1.1 at 1773233071
[riscv64] MI2a: target SELECTED: libcurl 8.19.0-alt1:sisyphus_riscv64+114193.100.1.1 at 1773233071
[riscv64] MI2a: requesting to install libcurl (unspec'd ver; inspect with Debug::pkgMark-shallow)
[riscv64] MI2a: marked for install (shallow): libcurl
[riscv64] MI2a: satisfying Depends: libbrotlidec.so.1()(64bit) >= set:heroOawuYbTK8
[riscv64] MI2a: maybe install (a providing target): libbrotlidec 1.2.0-alt1:sisyphus_riscv64+98962.100.1.1 at 1761678642
[riscv64] MI2a: target SELECTED: libbrotlidec 1.2.0-alt1:sisyphus_riscv64+98962.100.1.1 at 1761678642
[riscv64] MI2a: requesting to install libbrotlidec (unspec'd ver; inspect with Debug::pkgMark-shallow)
[riscv64] MI2a: marked for install (shallow): libbrotlidec
[riscv64] MI2a: satisfying Depends: libbrotlicommon = 1.2.0-alt1:sisyphus_riscv64+98962.100.1.1
[riscv64] MI2a: maybe install (a direct target): libbrotlicommon 1.2.0-alt1:sisyphus_riscv64+98962.100.1.1 at 1761678642
[riscv64] MI2a: target SELECTED: libbrotlicommon 1.2.0-alt1:sisyphus_riscv64+98962.100.1.1 at 1761678642
[riscv64] MI2a: requesting to install libbrotlicommon (unspec'd ver; inspect with Debug::pkgMark-shallow)
[riscv64] MI2a: marked for install (shallow): libbrotlicommon
[riscv64] MI2a: satisfying Depends: libgnutls.so.30()(64bit) >= set:ohWzKsl3gEhunQQpmsYd9i7QCtiGyfZ1Iaw1tOFZbdeEKESximCRPnIehs3AEMQXZ0e8KN9yV59f8Zeu5QHTtKkulI9mjuLg9NIizyZhpZCsx8sGEZDBhhgZvpnajdZvocWora9BdPXEcA4Z2ghEYo7SHlnQVUueZmZ3mRKhNiuOM9tTyPiwFvw4TZenCjcambbGWLShwembtEyVtUcNpLjugdka8b4
[riscv64] MI2a: maybe install (a providing target): libgnutls30 3.8.12-alt1:sisyphus_riscv64+110321.100.1.1 at 1770858507
[riscv64] MI2a: target SELECTED: libgnutls30 3.8.12-alt1:sisyphus_riscv64+110321.100.1.1 at 1770858507
[riscv64] MI2a: requesting to install libgnutls30 (unspec'd ver; inspect with Debug::pkgMark-shallow)
[riscv64] MI2a: marked for install (shallow): libgnutls30
[riscv64] MI2a: satisfying Depends: libhogweed.so.6()(64bit) >= set:mfnnj2ZgBdeg17M87tPneezLu1hRaAv7Mvee2P332bHTaZjeCozdeChKl8zpQyflmS6Vy6tRmgHXyW1dkybK4gSLUc4ZqST6Otwai2tAwz0231mJ0KXX1SRmE5Wv1xA3elkz1fS4ARIDtHglVAVYGsrdTpOlAk7oFZ51ji2BIsI0W6X7ePZg
[riscv64] MI2a: maybe install (a providing target): libhogweed6 3.10.1-alt1:sisyphus_riscv64+71375.100.1.1 at 1738106891
[riscv64] MI2a: target SELECTED: libhogweed6 3.10.1-alt1:sisyphus_riscv64+71375.100.1.1 at 1738106891
[riscv64] MI2a: requesting to install libhogweed6 (unspec'd ver; inspect with Debug::pkgMark-shallow)
[riscv64] MI2a: marked for install (shallow): libhogweed6
[riscv64] MI2a: satisfying Depends: libnettle8 = 3.10.1-alt1:sisyphus_riscv64+71375.100.1.1
[riscv64] MI2a: maybe install (a direct target): libnettle8 3.10.1-alt1:sisyphus_riscv64+71375.100.1.1 at 1738106891
[riscv64] MI2a: target SELECTED: libnettle8 3.10.1-alt1:sisyphus_riscv64+71375.100.1.1 at 1738106891
[riscv64] MI2a: requesting to install libnettle8 (unspec'd ver; inspect with Debug::pkgMark-shallow)
[riscv64] MI2a: marked for install (shallow): libnettle8
[riscv64] MI2a: satisfying Depends: libidn2.so.0()(64bit) >= set:ifaFMURofX11
[riscv64] MI2a: maybe install (a providing target): libidn2 2.3.8-alt1:sisyphus_riscv64+93492.100.1.1 at 1756433243
[riscv64] MI2a: target SELECTED: libidn2 2.3.8-alt1:sisyphus_riscv64+93492.100.1.1 at 1756433243
[riscv64] MI2a: requesting to install libidn2 (unspec'd ver; inspect with Debug::pkgMark-shallow)
[riscv64] MI2a: marked for install (shallow): libidn2
[riscv64] MI2a: satisfying Depends: libgssapi_krb5.so.2()(64bit) >= set:lherpSlTisKmUUCXy5icVuAslwGLwcm0
[riscv64] MI2a: maybe install (a providing target): libkrb5 1.22.2-alt1:sisyphus_riscv64+109182.100.1.1 at 1770257536
[riscv64] MI2a: target SELECTED: libkrb5 1.22.2-alt1:sisyphus_riscv64+109182.100.1.1 at 1770257536
[riscv64] MI2a: requesting to install libkrb5 (unspec'd ver; inspect with Debug::pkgMark-shallow)
[riscv64] MI2a: marked for install (shallow): libkrb5
[riscv64] MI2a: satisfying Depends: libcom_err.so.2()(64bit) >= set:ifPl8xIvqGQAmqI1
[riscv64] MI2a: maybe install (a providing target): libcom_err 1.47.1.0.10.ad56-alt2:sisyphus_riscv64+65703.100.1.1 at 1732769486
[riscv64] MI2a: target SELECTED: libcom_err 1.47.1.0.10.ad56-alt2:sisyphus_riscv64+65703.100.1.1 at 1732769486
[riscv64] MI2a: requesting to install libcom_err (unspec'd ver; inspect with Debug::pkgMark-shallow)
[riscv64] MI2a: marked for install (shallow): libcom_err
[riscv64] MI2a: satisfying Depends: libkeyutils.so.1()(64bit) >= set:jfWn12U6KThBXgruPLZ68yYZt2
[riscv64] MI2a: maybe install (a providing target): libkeyutils 1.6.3-alt1:sisyphus_riscv64+49335.100.1.1 at 1716592270
[riscv64] MI2a: target SELECTED: libkeyutils 1.6.3-alt1:sisyphus_riscv64+49335.100.1.1 at 1716592270
[riscv64] MI2a: requesting to install libkeyutils (unspec'd ver; inspect with Debug::pkgMark-shallow)
[riscv64] MI2a: marked for install (shallow): libkeyutils
[riscv64] MI2a: satisfying Depends: liblmdb.so.0()(64bit) >= set:kfalKd4xYAkaAG2MqeH0wB2F4kTaBEo1iv0KFpxVmqzFIV6HJ0
[riscv64] MI2a: maybe install (a providing target): liblmdb 0.9.35-alt1:sisyphus_riscv64+111449.100.1.1 at 1771669538
[riscv64] MI2a: target SELECTED: liblmdb 0.9.35-alt1:sisyphus_riscv64+111449.100.1.1 at 1771669538
[riscv64] MI2a: requesting to install liblmdb (unspec'd ver; inspect with Debug::pkgMark-shallow)
[riscv64] MI2a: marked for install (shallow): liblmdb
[riscv64] MI2a: satisfying Depends: libverto.so.1()(64bit) >= set:jfI5MRvI6tmNn0zwQdb68Gk0
[riscv64] MI2a: maybe install (a providing target): libverto 0.3.2-alt1_1:sisyphus_riscv64+33133.1200.2.1 at 1684932150
[riscv64] MI2a: target SELECTED: libverto 0.3.2-alt1_1:sisyphus_riscv64+33133.1200.2.1 at 1684932150
[riscv64] MI2a: requesting to install libverto (unspec'd ver; inspect with Debug::pkgMark-shallow)
[riscv64] MI2a: marked for install (shallow): libverto
[riscv64] MI2a: satisfying Depends: liblber.so.2()(64bit) >= set:liRJP9c9FzZ8q5FRsZ21
[riscv64] MI2a: maybe install (a providing target): libldap2 2.6.13-alt1:sisyphus_riscv64+115149.100.1.1 at 1773831165
[riscv64] MI2a: target SELECTED: libldap2 2.6.13-alt1:sisyphus_riscv64+115149.100.1.1 at 1773831165
[riscv64] MI2a: requesting to install libldap2 (unspec'd ver; inspect with Debug::pkgMark-shallow)
[riscv64] MI2a: marked for install (shallow): libldap2
[riscv64] MI2a: satisfying Depends: libsasl2.so.3()(64bit) >= set:lhKAh7QjCM36Vnr6MdFxFf8LIcZsS1kl0wH7Iyp
[riscv64] MI2a: maybe install (a providing target): libsasl2-3 2.1.28-alt3:sisyphus_riscv64+97037.1100.1.1 at 1761044620
[riscv64] MI2a: target SELECTED: libsasl2-3 2.1.28-alt3:sisyphus_riscv64+97037.1100.1.1 at 1761044620
[riscv64] MI2a: requesting to install libsasl2-3 (unspec'd ver; inspect with Debug::pkgMark-shallow)
[riscv64] MI2a: marked for install (shallow): libsasl2-3
[riscv64] MI2a: satisfying Depends: openldap-common = 2.6.13-alt1:sisyphus_riscv64+115149.100.1.1
[riscv64] MI2a: maybe install (a direct target): openldap-common 2.6.13-alt1:sisyphus_riscv64+115149.100.1.1 at 1773831165
[riscv64] MI2a: target SELECTED: openldap-common 2.6.13-alt1:sisyphus_riscv64+115149.100.1.1 at 1773831165
[riscv64] MI2a: requesting to install openldap-common (unspec'd ver; inspect with Debug::pkgMark-shallow)
[riscv64] MI2a: marked for install (shallow): openldap-common
[riscv64] MI2a: satisfying Depends: libnghttp2.so.14()(64bit) >= set:lfKRgJ8UKsv8mdZbLF8OxWTLVASoUAdxTu6rssIpilYsUcqHL2CMZk6qphw90tGPaquCWnihEqT3x957koIkZCHIxV7ahJ9tEyXiPz1HGgyJf9XN1
[riscv64] MI2a: maybe install (a providing target): libnghttp2 1.69.0-alt1:sisyphus_riscv64+119674.100.1.1 at 1776693019
[riscv64] MI2a: target SELECTED: libnghttp2 1.69.0-alt1:sisyphus_riscv64+119674.100.1.1 at 1776693019
[riscv64] MI2a: requesting to install libnghttp2 (unspec'd ver; inspect with Debug::pkgMark-shallow)
[riscv64] MI2a: marked for install (shallow): libnghttp2
[riscv64] MI2a: satisfying Depends: libnghttp3.so.9()(64bit) >= set:kfOHsymuRovZfZIawj4ST8bIZ8gAm9fzcRFVxt87YccZeAlZwFcI1
[riscv64] MI2a: maybe install (a providing target): libnghttp3.9 1.15.0-alt1:sisyphus_riscv64+109528.100.1.1 at 1770403504
[riscv64] MI2a: target SELECTED: libnghttp3.9 1.15.0-alt1:sisyphus_riscv64+109528.100.1.1 at 1770403504
[riscv64] MI2a: requesting to install libnghttp3.9 (unspec'd ver; inspect with Debug::pkgMark-shallow)
[riscv64] MI2a: marked for install (shallow): libnghttp3.9
[riscv64] MI2a: satisfying Depends: libngtcp2.so.16()(64bit) >= set:keggzSiMInQoBgrlYWxUop2IDL4Ex9NmxfNlE3UoZ6bvfiZqFvOST53COjeztU9wCUsjA8uuZ8sodbhSgNzKYVngELjUy4
[riscv64] MI2a: maybe install (a providing target): libngtcp2.16 1.22.1-alt1:sisyphus_riscv64+119497.100.1.1 at 1776530589
[riscv64] MI2a: target SELECTED: libngtcp2.16 1.22.1-alt1:sisyphus_riscv64+119497.100.1.1 at 1776530589
[riscv64] MI2a: requesting to install libngtcp2.16 (unspec'd ver; inspect with Debug::pkgMark-shallow)
[riscv64] MI2a: marked for install (shallow): libngtcp2.16
[riscv64] MI2a: satisfying Depends: libngtcp2_crypto_gnutls8 = 1.22.1-alt1:sisyphus_riscv64+119497.100.1.1
[riscv64] MI2a: maybe install (a direct target): libngtcp2_crypto_gnutls8 1.22.1-alt1:sisyphus_riscv64+119497.100.1.1 at 1776530589
[riscv64] MI2a: target SELECTED: libngtcp2_crypto_gnutls8 1.22.1-alt1:sisyphus_riscv64+119497.100.1.1 at 1776530589
[riscv64] MI2a: requesting to install libngtcp2_crypto_gnutls8 (unspec'd ver; inspect with Debug::pkgMark-shallow)
[riscv64] MI2a: marked for install (shallow): libngtcp2_crypto_gnutls8
[riscv64] MI2a: satisfying Depends: libpsl.so.5()(64bit) >= set:ifo8sG4NYozTZj0
[riscv64] MI2a: maybe install (a providing target): libpsl 0.21.5-alt2:sisyphus_riscv64+113057.100.1.1 at 1772681237
[riscv64] MI2a: target SELECTED: libpsl 0.21.5-alt2:sisyphus_riscv64+113057.100.1.1 at 1772681237
[riscv64] MI2a: requesting to install libpsl (unspec'd ver; inspect with Debug::pkgMark-shallow)
[riscv64] MI2a: marked for install (shallow): libpsl
[riscv64] MI2a: satisfying Depends: publicsuffix-list-dafsa (NULL)
[riscv64] MI2a: maybe install (a direct target): publicsuffix-list-dafsa 20260302-alt1:sisyphus_riscv64+113004.100.1.1 at 1772666916
[riscv64] MI2a: target SELECTED: publicsuffix-list-dafsa 20260302-alt1:sisyphus_riscv64+113004.100.1.1 at 1772666916
[riscv64] MI2a: requesting to install publicsuffix-list-dafsa (unspec'd ver; inspect with Debug::pkgMark-shallow)
[riscv64] MI2a: marked for install (shallow): publicsuffix-list-dafsa
[riscv64] MI2a: satisfying Depends: libssh2.so.1()(64bit) >= set:lfFi2ZJdCZnNQqC7FxZHyYYVCMxI4j17rwEg278PVigoIDqIcaZ7xJLD99atVtQH9iZsC5Ell61tgIGFLCeeSh67CMC5lPNAQgzzPc5RvPDTKNRR6pS6HYOOQEA2K29rU2BrZhHHo1LquRo5Z2v1
[riscv64] MI2a: maybe install (a providing target): libssh2 1.11.1-alt1:sisyphus_riscv64+105876.100.1.1 at 1767360901
[riscv64] MI2a: target SELECTED: libssh2 1.11.1-alt1:sisyphus_riscv64+105876.100.1.1 at 1767360901
[riscv64] MI2a: requesting to install libssh2 (unspec'd ver; inspect with Debug::pkgMark-shallow)
[riscv64] MI2a: marked for install (shallow): libssh2
[riscv64] MI2a: satisfying Depends: libjsoncpp.so.24()(64bit) >= set:mfWdNr9hSTEj33pgekkWiZ5gxiSrhe4i6fCrcyUrA0F5fpZ4CuAAbvZEaLNDQoZ1XGHPAxHVDJ5aZ8J4EOS5Ph9IjMNpQdqYunbBZ41SG8ORLJvBHW7puYYi760ZFTIxHsoUGjwulnr1aj60ioshZ86OzriUK9i3sdbhS3TUeesGtiqSY443ccil09T2sqefesYqfSWyFayk8DyeCwIzPv0
[riscv64] MI2a: maybe install (a providing target): libjsoncpp24 1.9.4-alt2:sisyphus_riscv64+49295.100.1.1 at 1716568573
[riscv64] MI2a: target SELECTED: libjsoncpp24 1.9.4-alt2:sisyphus_riscv64+49295.100.1.1 at 1716568573
[riscv64] MI2a: requesting to install libjsoncpp24 (unspec'd ver; inspect with Debug::pkgMark-shallow)
[riscv64] MI2a: marked for install (shallow): libjsoncpp24
[riscv64] MI2a: satisfying Depends: librhash.so.0()(64bit) >= set:ifDyZ6eqLIBMAAMoeF3
[riscv64] MI2a: maybe install (a providing target): librhash 1.3.5-alt3:sisyphus_riscv64+11373.100.1.1 at 1635835354
[riscv64] MI2a: target SELECTED: librhash 1.3.5-alt3:sisyphus_riscv64+11373.100.1.1 at 1635835354
[riscv64] MI2a: requesting to install librhash (unspec'd ver; inspect with Debug::pkgMark-shallow)
[riscv64] MI2a: marked for install (shallow): librhash
[riscv64] MI2a: satisfying Depends: libuv.so.1()(64bit) >= set:mhRqUeic58tAOj8qzoZvhgcZFirSpyDd3iNFI57V8pPeIZrSvA2qcK8FfNrygsaEqZ6VfZGZvj3
[riscv64] MI2a: maybe install (a providing target): libuv 1.52.1-alt2:sisyphus_riscv64+118402.100.1.1 at 1775741504
[riscv64] MI2a: target SELECTED: libuv 1.52.1-alt2:sisyphus_riscv64+118402.100.1.1 at 1775741504
[riscv64] MI2a: requesting to install libuv (unspec'd ver; inspect with Debug::pkgMark-shallow)
[riscv64] MI2a: marked for install (shallow): libuv
[riscv64] MI2a: satisfying Depends: cmake-modules = 4.2.3-alt1:sisyphus_riscv64+113670.100.1.1
[riscv64] MI2a: maybe install (a direct target): cmake-modules 4.2.3-alt1:sisyphus_riscv64+113670.100.1.1 at 1773073377
[riscv64] MI2a: target SELECTED: cmake-modules 4.2.3-alt1:sisyphus_riscv64+113670.100.1.1 at 1773073377
[riscv64] MI2a: requesting to install cmake-modules (unspec'd ver; inspect with Debug::pkgMark-shallow)
[riscv64] MI2a: marked for install (shallow): cmake-modules
[riscv64] MI2a: marked for install (shallow): gcc-c++
[riscv64] MI2a: satisfying Depends: gcc14-c++ (NULL)
[riscv64] MI2a: maybe install (a direct target): gcc14-c++ 14.3.1-alt0.port.2:sisyphus_riscv64+98534.200.1.1 at 1761243914
[riscv64] MI2a: target SELECTED: gcc14-c++ 14.3.1-alt0.port.2:sisyphus_riscv64+98534.200.1.1 at 1761243914
[riscv64] MI2a: requesting to install gcc14-c++ (unspec'd ver; inspect with Debug::pkgMark-shallow)
[riscv64] MI2a: marked for install (shallow): gcc14-c++
[riscv64] MI2a: satisfying Depends: libstdc++14-devel = 14.3.1-alt0.port.2:sisyphus_riscv64+98534.200.1.1
[riscv64] MI2a: maybe install (a direct target): libstdc++14-devel 14.3.1-alt0.port.2:sisyphus_riscv64+98534.200.1.1 at 1761243914
[riscv64] MI2a: target SELECTED: libstdc++14-devel 14.3.1-alt0.port.2:sisyphus_riscv64+98534.200.1.1 at 1761243914
[riscv64] MI2a: requesting to install libstdc++14-devel (unspec'd ver; inspect with Debug::pkgMark-shallow)
[riscv64] MI2a: marked for install (shallow): libstdc++14-devel
[riscv64] MI2a: satisfying PreDepends: gcc-c++-common >= 1.4.7
[riscv64] MI2a: maybe install (a direct target): gcc-c++-common 1.4.28-alt1:sisyphus_riscv64+49202.100.1.1 at 1716505224
[riscv64] MI2a: target SELECTED: gcc-c++-common 1.4.28-alt1:sisyphus_riscv64+49202.100.1.1 at 1716505224
[riscv64] MI2a: requesting to install gcc-c++-common (unspec'd ver; inspect with Debug::pkgMark-shallow)
[riscv64] MI2a: marked for install (shallow): gcc-c++-common
[riscv64] MI2a: marked for install (shallow): libwayland-client-devel
[riscv64] MI2a: satisfying Depends: wayland-devel = 1.25.0-alt1.1:sisyphus_riscv64+115618.100.1.2
[riscv64] MI2a: maybe install (a direct target): wayland-devel 1.25.0-alt1.1:sisyphus_riscv64+115618.100.1.2 at 1774026510
[riscv64] MI2a: target SELECTED: wayland-devel 1.25.0-alt1.1:sisyphus_riscv64+115618.100.1.2 at 1774026510
[riscv64] MI2a: requesting to install wayland-devel (unspec'd ver; inspect with Debug::pkgMark-shallow)
[riscv64] MI2a: marked for install (shallow): wayland-devel
[riscv64] MI2a: satisfying Depends: libwayland-client = 1.25.0-alt1.1:sisyphus_riscv64+115618.100.1.2
[riscv64] MI2a: maybe install (a direct target): libwayland-client 1.25.0-alt1.1:sisyphus_riscv64+115618.100.1.2 at 1774026510
[riscv64] MI2a: target SELECTED: libwayland-client 1.25.0-alt1.1:sisyphus_riscv64+115618.100.1.2 at 1774026510
[riscv64] MI2a: requesting to install libwayland-client (unspec'd ver; inspect with Debug::pkgMark-shallow)
[riscv64] MI2a: marked for install (shallow): libwayland-client
[riscv64] MI2a: marked for install (shallow): libwayland-cursor-devel
[riscv64] MI2a: satisfying Depends: libwayland-cursor = 1.25.0-alt1.1:sisyphus_riscv64+115618.100.1.2
[riscv64] MI2a: maybe install (a direct target): libwayland-cursor 1.25.0-alt1.1:sisyphus_riscv64+115618.100.1.2 at 1774026510
[riscv64] MI2a: target SELECTED: libwayland-cursor 1.25.0-alt1.1:sisyphus_riscv64+115618.100.1.2 at 1774026510
[riscv64] MI2a: requesting to install libwayland-cursor (unspec'd ver; inspect with Debug::pkgMark-shallow)
[riscv64] MI2a: marked for install (shallow): libwayland-cursor
[riscv64] MI2a: marked for install (shallow): libxkbcommon-devel
[riscv64] MI2a: satisfying Depends: libxkbcommon = 1.13.1-alt1:sisyphus_riscv64+102701.100.1.1
[riscv64] MI2a: maybe install (a direct target): libxkbcommon 1.13.1-alt1:sisyphus_riscv64+102701.100.1.1 at 1764832910
[riscv64] MI2a: target SELECTED: libxkbcommon 1.13.1-alt1:sisyphus_riscv64+102701.100.1.1 at 1764832910
[riscv64] MI2a: requesting to install libxkbcommon (unspec'd ver; inspect with Debug::pkgMark-shallow)
[riscv64] MI2a: marked for install (shallow): libxkbcommon
[riscv64] MI2a: marked for install (shallow): libcairo-devel
[riscv64] MI2a: satisfying Depends: fontconfig-devel (NULL)
[riscv64] MI2a: maybe install (a direct target): fontconfig-devel 2.17.1-alt2:sisyphus_riscv64+93955.100.1.1 at 1756945910
[riscv64] MI2a: target SELECTED: fontconfig-devel 2.17.1-alt2:sisyphus_riscv64+93955.100.1.1 at 1756945910
[riscv64] MI2a: requesting to install fontconfig-devel (unspec'd ver; inspect with Debug::pkgMark-shallow)
[riscv64] MI2a: marked for install (shallow): fontconfig-devel
[riscv64] MI2a: satisfying Depends: libfreetype-devel (NULL)
[riscv64] MI2a: maybe install (a direct target): libfreetype-devel 2.14.3-alt1:sisyphus_riscv64+116242.100.1.1 at 1774475273
[riscv64] MI2a: target SELECTED: libfreetype-devel 2.14.3-alt1:sisyphus_riscv64+116242.100.1.1 at 1774475273
[riscv64] MI2a: requesting to install libfreetype-devel (unspec'd ver; inspect with Debug::pkgMark-shallow)
[riscv64] MI2a: marked for install (shallow): libfreetype-devel
[riscv64] MI2a: satisfying Depends: libharfbuzz-devel (NULL)
[riscv64] MI2a: maybe install (a direct target): libharfbuzz-devel 14.2.0-alt1:sisyphus_riscv64+119763.100.1.1 at 1776728642
[riscv64] MI2a: target SELECTED: libharfbuzz-devel 14.2.0-alt1:sisyphus_riscv64+119763.100.1.1 at 1776728642
[riscv64] MI2a: requesting to install libharfbuzz-devel (unspec'd ver; inspect with Debug::pkgMark-shallow)
[riscv64] MI2a: marked for install (shallow): libharfbuzz-devel
[riscv64] MI2a: satisfying Depends: glib2-devel (NULL)
[riscv64] MI2a: maybe install (a direct target): glib2-devel 2.88.0-alt1:sisyphus_riscv64+115074.100.1.1 at 1773735024
[riscv64] MI2a: target SELECTED: glib2-devel 2.88.0-alt1:sisyphus_riscv64+115074.100.1.1 at 1773735024
[riscv64] MI2a: requesting to install glib2-devel (unspec'd ver; inspect with Debug::pkgMark-shallow)
[riscv64] MI2a: marked for install (shallow): glib2-devel
[riscv64] MI2a: satisfying Depends: rpm-build-gir >= 0.5
[riscv64] MI2a: maybe install (a direct target): rpm-build-gir 0.7.3-alt3.1:sisyphus_riscv64+32169.100.1.1 at 1683014292
[riscv64] MI2a: target SELECTED: rpm-build-gir 0.7.3-alt3.1:sisyphus_riscv64+32169.100.1.1 at 1683014292
[riscv64] MI2a: requesting to install rpm-build-gir (unspec'd ver; inspect with Debug::pkgMark-shallow)
[riscv64] MI2a: marked for install (shallow): rpm-build-gir
[riscv64] MI2a: satisfying Depends: xml-utils (NULL)
[riscv64] MI2a: maybe install (a direct target): xml-utils 1:2.14.6-alt3:sisyphus_riscv64+112566.100.1.1 at 1772465777
[riscv64] MI2a: target SELECTED: xml-utils 1:2.14.6-alt3:sisyphus_riscv64+112566.100.1.1 at 1772465777
[riscv64] MI2a: requesting to install xml-utils (unspec'd ver; inspect with Debug::pkgMark-shallow)
[riscv64] MI2a: marked for install (shallow): xml-utils
[riscv64] MI2a: satisfying Depends: xml-common (NULL)
[riscv64] MI2a: maybe install (a direct target): xml-common 0.6.3-alt15:sisyphus_riscv64+8304.100.1.1 at 1632333716
[riscv64] MI2a: target SELECTED: xml-common 0.6.3-alt15:sisyphus_riscv64+8304.100.1.1 at 1632333716
[riscv64] MI2a: requesting to install xml-common (unspec'd ver; inspect with Debug::pkgMark-shallow)
[riscv64] MI2a: marked for install (shallow): xml-common
[riscv64] MI2a: satisfying Depends: libgio = 2.88.0-alt1:sisyphus_riscv64+115074.100.1.1
[riscv64] MI2a: maybe install (a direct target): libgio 2.88.0-alt1:sisyphus_riscv64+115074.100.1.1 at 1773735024
[riscv64] MI2a: target SELECTED: libgio 2.88.0-alt1:sisyphus_riscv64+115074.100.1.1 at 1773735024
[riscv64] MI2a: requesting to install libgio (unspec'd ver; inspect with Debug::pkgMark-shallow)
[riscv64] MI2a: marked for install (shallow): libgio
[riscv64] MI2a: satisfying Depends: gsettings-desktop-schemas (NULL)
[riscv64] MI2a: maybe install (a direct target): gsettings-desktop-schemas 50.1-alt1:sisyphus_riscv64+119263.100.1.1 at 1776369800
[riscv64] MI2a: target SELECTED: gsettings-desktop-schemas 50.1-alt1:sisyphus_riscv64+119263.100.1.1 at 1776369800
[riscv64] MI2a: requesting to install gsettings-desktop-schemas (unspec'd ver; inspect with Debug::pkgMark-shallow)
[riscv64] MI2a: marked for install (shallow): gsettings-desktop-schemas
[riscv64] MI2a: satisfying Depends: gsettings-desktop-schemas-data = 50.1-alt1:sisyphus_riscv64+119263.100.1.1
[riscv64] MI2a: maybe install (a direct target): gsettings-desktop-schemas-data 50.1-alt1:sisyphus_riscv64+119263.100.1.1 at 1776369800
[riscv64] MI2a: target SELECTED: gsettings-desktop-schemas-data 50.1-alt1:sisyphus_riscv64+119263.100.1.1 at 1776369800
[riscv64] MI2a: requesting to install gsettings-desktop-schemas-data (unspec'd ver; inspect with Debug::pkgMark-shallow)
[riscv64] MI2a: marked for install (shallow): gsettings-desktop-schemas-data
[riscv64] MI2a: satisfying Depends: shared-mime-info >= 0.80
[riscv64] MI2a: maybe install (a direct target): shared-mime-info 2.4-alt1.1:sisyphus_riscv64+98006.100.1.1 at 1761452959
[riscv64] MI2a: target SELECTED: shared-mime-info 2.4-alt1.1:sisyphus_riscv64+98006.100.1.1 at 1761452959
[riscv64] MI2a: requesting to install shared-mime-info (unspec'd ver; inspect with Debug::pkgMark-shallow)
[riscv64] MI2a: marked for install (shallow): shared-mime-info
[riscv64] MI2a: satisfying Depends: /usr/bin/update-desktop-database (NULL)
[riscv64] MI2a: maybe install (a providing target): desktop-file-utils 0.26-alt6:sisyphus_riscv64+39350.100.1.1 at 1697747180
[riscv64] MI2a: target SELECTED: desktop-file-utils 0.26-alt6:sisyphus_riscv64+39350.100.1.1 at 1697747180
[riscv64] MI2a: requesting to install desktop-file-utils (unspec'd ver; inspect with Debug::pkgMark-shallow)
[riscv64] MI2a: marked for install (shallow): desktop-file-utils
[riscv64] MI2a: satisfying Depends: libgraphite2-devel (NULL)
[riscv64] MI2a: maybe install (a direct target): libgraphite2-devel 1.3.14-alt2.1:sisyphus_riscv64+8428.100.1.1 at 1633104905
[riscv64] MI2a: target SELECTED: libgraphite2-devel 1.3.14-alt2.1:sisyphus_riscv64+8428.100.1.1 at 1633104905
[riscv64] MI2a: requesting to install libgraphite2-devel (unspec'd ver; inspect with Debug::pkgMark-shallow)
[riscv64] MI2a: marked for install (shallow): libgraphite2-devel
[riscv64] MI2a: satisfying Depends: libgraphite2 = 1.3.14-alt2.1:sisyphus_riscv64+8428.100.1.1
[riscv64] MI2a: maybe install (a direct target): libgraphite2 1.3.14-alt2.1:sisyphus_riscv64+8428.100.1.1 at 1633104905
[riscv64] MI2a: target SELECTED: libgraphite2 1.3.14-alt2.1:sisyphus_riscv64+8428.100.1.1 at 1633104905
[riscv64] MI2a: requesting to install libgraphite2 (unspec'd ver; inspect with Debug::pkgMark-shallow)
[riscv64] MI2a: marked for install (shallow): libgraphite2
[riscv64] MI2a: satisfying Depends: libicu-devel (NULL)
[riscv64] MI2a: maybe install (a direct target): libicu-devel 1:7.6.1-alt1:sisyphus_riscv64+74138.100.1.1 at 1740321561
[riscv64] MI2a: target SELECTED: libicu-devel 1:7.6.1-alt1:sisyphus_riscv64+74138.100.1.1 at 1740321561
[riscv64] MI2a: requesting to install libicu-devel (unspec'd ver; inspect with Debug::pkgMark-shallow)
[riscv64] MI2a: marked for install (shallow): libicu-devel
[riscv64] MI2a: satisfying Depends: icu-utils = 1:7.6.1-alt1:sisyphus_riscv64+74138.100.1.1
[riscv64] MI2a: maybe install (a direct target): icu-utils 1:7.6.1-alt1:sisyphus_riscv64+74138.100.1.1 at 1740321561
[riscv64] MI2a: target SELECTED: icu-utils 1:7.6.1-alt1:sisyphus_riscv64+74138.100.1.1 at 1740321561
[riscv64] MI2a: requesting to install icu-utils (unspec'd ver; inspect with Debug::pkgMark-shallow)
[riscv64] MI2a: marked for install (shallow): icu-utils
[riscv64] MI2a: satisfying Depends: libicu76 = 1:7.6.1-alt1:sisyphus_riscv64+74138.100.1.1
[riscv64] MI2a: maybe install (a direct target): libicu76 1:7.6.1-alt1:sisyphus_riscv64+74138.100.1.1 at 1740321561
[riscv64] MI2a: target SELECTED: libicu76 1:7.6.1-alt1:sisyphus_riscv64+74138.100.1.1 at 1740321561
[riscv64] MI2a: requesting to install libicu76 (unspec'd ver; inspect with Debug::pkgMark-shallow)
[riscv64] MI2a: marked for install (shallow): libicu76
[riscv64] MI2a: satisfying Depends: libharfbuzz-icu = 14.2.0-alt1:sisyphus_riscv64+119763.100.1.1
[riscv64] MI2a: maybe install (a direct target): libharfbuzz-icu 14.2.0-alt1:sisyphus_riscv64+119763.100.1.1 at 1776728642
[riscv64] MI2a: target SELECTED: libharfbuzz-icu 14.2.0-alt1:sisyphus_riscv64+119763.100.1.1 at 1776728642
[riscv64] MI2a: requesting to install libharfbuzz-icu (unspec'd ver; inspect with Debug::pkgMark-shallow)
[riscv64] MI2a: marked for install (shallow): libharfbuzz-icu
[riscv64] MI2a: satisfying Depends: libharfbuzz = 14.2.0-alt1:sisyphus_riscv64+119763.100.1.1
[riscv64] MI2a: maybe install (a direct target): libharfbuzz 14.2.0-alt1:sisyphus_riscv64+119763.100.1.1 at 1776728642
[riscv64] MI2a: target SELECTED: libharfbuzz 14.2.0-alt1:sisyphus_riscv64+119763.100.1.1 at 1776728642
[riscv64] MI2a: requesting to install libharfbuzz (unspec'd ver; inspect with Debug::pkgMark-shallow)
[riscv64] MI2a: marked for install (shallow): libharfbuzz
[riscv64] MI2a: satisfying Depends: libfreetype.so.6()(64bit) >= set:lfVtlTnvMLIZ9o6j6U9adZ7nALl1r8SARmLB0k32OWyOrFrgtpzKFOO7XPX0x2vVzzVZgHFaHiOJCaG9NYH3AUo8
[riscv64] MI2a: maybe install (a providing target): libfreetype 2.14.3-alt1:sisyphus_riscv64+116242.100.1.1 at 1774475273
[riscv64] MI2a: target SELECTED: libfreetype 2.14.3-alt1:sisyphus_riscv64+116242.100.1.1 at 1774475273
[riscv64] MI2a: requesting to install libfreetype (unspec'd ver; inspect with Debug::pkgMark-shallow)
[riscv64] MI2a: marked for install (shallow): libfreetype
[riscv64] MI2a: satisfying Depends: libpng16.so.16()(64bit) >= set:lgOKIQUxni0O7jHgjpNW6A1wpahp3UbHTCRKMJBuQNMRZ2RrxxTI5e42UDd
[riscv64] MI2a: maybe install (a providing target): libpng16 1.6.56-alt2:sisyphus_riscv64+116624.100.1.1 at 1774644819
[riscv64] MI2a: target SELECTED: libpng16 1.6.56-alt2:sisyphus_riscv64+116624.100.1.1 at 1774644819
[riscv64] MI2a: requesting to install libpng16 (unspec'd ver; inspect with Debug::pkgMark-shallow)
[riscv64] MI2a: marked for install (shallow): libpng16
[riscv64] MI2a: satisfying Depends: libharfbuzz-cairo = 14.2.0-alt1:sisyphus_riscv64+119763.100.1.1
[riscv64] MI2a: maybe install (a direct target): libharfbuzz-cairo 14.2.0-alt1:sisyphus_riscv64+119763.100.1.1 at 1776728642
[riscv64] MI2a: target SELECTED: libharfbuzz-cairo 14.2.0-alt1:sisyphus_riscv64+119763.100.1.1 at 1776728642
[riscv64] MI2a: requesting to install libharfbuzz-cairo (unspec'd ver; inspect with Debug::pkgMark-shallow)
[riscv64] MI2a: marked for install (shallow): libharfbuzz-cairo
[riscv64] MI2a: satisfying Depends: libcairo.so.2()(64bit) >= set:mfpiqUPtlWC213CjFswusVvai8IfikRXTv5N9DGwGgsA03i432Y9YuRsQMm7qwMkdxH81aaPMJo5Qf1PZwMDibM7ngUnaORejPbpXpUFJF0yL3yu12eoxfszUNaX9zapPjQXTDy9ZmEnNQUxgYZzrHYyndPpWv0k
[riscv64] MI2a: maybe install (a providing target): libcairo 1:1.18.4-alt1:sisyphus_riscv64+75640.100.1.1 at 1741606770
[riscv64] MI2a: target SELECTED: libcairo 1:1.18.4-alt1:sisyphus_riscv64+75640.100.1.1 at 1741606770
[riscv64] MI2a: requesting to install libcairo (unspec'd ver; inspect with Debug::pkgMark-shallow)
[riscv64] MI2a: marked for install (shallow): libcairo
[riscv64] MI2a: satisfying Depends: libX11.so.6()(64bit) >= set:ojiyqPZBmmfzgwzMZglwYl9tc2Z8kKi3aiMtS8qA172JMuQxBIf0kdv8fXcVXy4ZozMDGOji44SaCLk0hy4PXEKxSp4DA30
[riscv64] MI2a: maybe install (a providing target): libX11 3:1.8.13-alt1:sisyphus_riscv64+110010.100.1.1 at 1770694923
[riscv64] MI2a: target SELECTED: libX11 3:1.8.13-alt1:sisyphus_riscv64+110010.100.1.1 at 1770694923
[riscv64] MI2a: requesting to install libX11 (unspec'd ver; inspect with Debug::pkgMark-shallow)
[riscv64] MI2a: marked for install (shallow): libX11
[riscv64] MI2a: satisfying Depends: libxcb.so.1()(64bit) >= set:ni0Q79T9m8c8LtIHEZvE2to7CMOpYYJtPQlu1To9g36rmZ7fk1
[riscv64] MI2a: maybe install (a providing target): libxcb 1.17.0-alt1:sisyphus_riscv64+47651.200.1.1 at 1713376021
[riscv64] MI2a: target SELECTED: libxcb 1.17.0-alt1:sisyphus_riscv64+47651.200.1.1 at 1713376021
[riscv64] MI2a: requesting to install libxcb (unspec'd ver; inspect with Debug::pkgMark-shallow)
[riscv64] MI2a: marked for install (shallow): libxcb
[riscv64] MI2a: satisfying Depends: libXau.so.6()(64bit) >= set:ge34k81
[riscv64] MI2a: maybe install (a providing target): libXau 1.0.11-alt1:sisyphus_riscv64+26806.100.1.1 at 1670595777
[riscv64] MI2a: target SELECTED: libXau 1.0.11-alt1:sisyphus_riscv64+26806.100.1.1 at 1670595777
[riscv64] MI2a: requesting to install libXau (unspec'd ver; inspect with Debug::pkgMark-shallow)
[riscv64] MI2a: marked for install (shallow): libXau
[riscv64] MI2a: satisfying Depends: libXdmcp.so.6()(64bit) >= set:jiOzo
[riscv64] MI2a: maybe install (a providing target): libXdmcp 1.1.5-alt1:sisyphus_riscv64+46670.1000.1.1 at 1711473415
[riscv64] MI2a: target SELECTED: libXdmcp 1.1.5-alt1:sisyphus_riscv64+46670.1000.1.1 at 1711473415
[riscv64] MI2a: requesting to install libXdmcp (unspec'd ver; inspect with Debug::pkgMark-shallow)
[riscv64] MI2a: marked for install (shallow): libXdmcp
[riscv64] MI2a: satisfying Depends: libX11-locales = 3:1.8.13-alt1:sisyphus_riscv64+110010.100.1.1
[riscv64] MI2a: maybe install (a direct target): libX11-locales 3:1.8.13-alt1:sisyphus_riscv64+110010.100.1.1 at 1770694923
[riscv64] MI2a: target SELECTED: libX11-locales 3:1.8.13-alt1:sisyphus_riscv64+110010.100.1.1 at 1770694923
[riscv64] MI2a: requesting to install libX11-locales (unspec'd ver; inspect with Debug::pkgMark-shallow)
[riscv64] MI2a: marked for install (shallow): libX11-locales
[riscv64] MI2a: satisfying Depends: libXext.so.6()(64bit) >= set:liWLFjrE5ZFnp8BR49YNgd
[riscv64] MI2a: maybe install (a providing target): libXext 1.3.6-alt1:sisyphus_riscv64+46670.1100.1.1 at 1711473737
[riscv64] MI2a: target SELECTED: libXext 1.3.6-alt1:sisyphus_riscv64+46670.1100.1.1 at 1711473737
[riscv64] MI2a: requesting to install libXext (unspec'd ver; inspect with Debug::pkgMark-shallow)
[riscv64] MI2a: marked for install (shallow): libXext
[riscv64] MI2a: satisfying Depends: libXrender.so.1()(64bit) >= set:jeLBBL6Tk45rZLH1cHhNtsTHjVd1FcPaZxKsGXVHSYT5CZDZf5FhpZKAda0
[riscv64] MI2a: maybe install (a providing target): libXrender 0.9.12-alt1:sisyphus_riscv64+71951.100.1.1 at 1738665677
[riscv64] MI2a: target SELECTED: libXrender 0.9.12-alt1:sisyphus_riscv64+71951.100.1.1 at 1738665677
[riscv64] MI2a: requesting to install libXrender (unspec'd ver; inspect with Debug::pkgMark-shallow)
[riscv64] MI2a: marked for install (shallow): libXrender
[riscv64] MI2a: satisfying Depends: libfontconfig.so.1()(64bit) >= set:lgrzNlfZia7ygOCz07eWZ0KOYZAwpZIE58LhWZuTPkrTHdXfqrcYNCfa1
[riscv64] MI2a: maybe install (a providing target): libfontconfig1 2.17.1-alt2:sisyphus_riscv64+93955.100.1.1 at 1756945910
[riscv64] MI2a: target SELECTED: libfontconfig1 2.17.1-alt2:sisyphus_riscv64+93955.100.1.1 at 1756945910
[riscv64] MI2a: requesting to install libfontconfig1 (unspec'd ver; inspect with Debug::pkgMark-shallow)
[riscv64] MI2a: marked for install (shallow): libfontconfig1
[riscv64] MI2a: satisfying Depends: libpixman-1.so.0()(64bit) >= set:lf5ZwVcdOaeX8umXJ79HaB3YzsrHCJDfOJGHnnAQbNpbqjYwfa3veu4vGMcCZkV5LigXOOqd1gBECaxIxFZiNURf5LMuSnyxSabeKKEZosAGBKKT3SyZBY7IWI0
[riscv64] MI2a: maybe install (a providing target): libpixman 3:0.46.4-alt0.port:sisyphus_riscv64+90345.100.1.1 at 1753351026
[riscv64] MI2a: target SELECTED: libpixman 3:0.46.4-alt0.port:sisyphus_riscv64+90345.100.1.1 at 1753351026
[riscv64] MI2a: requesting to install libpixman (unspec'd ver; inspect with Debug::pkgMark-shallow)
[riscv64] MI2a: marked for install (shallow): libpixman
[riscv64] MI2a: satisfying Depends: libharfbuzz-gobject = 14.2.0-alt1:sisyphus_riscv64+119763.100.1.1
[riscv64] MI2a: maybe install (a direct target): libharfbuzz-gobject 14.2.0-alt1:sisyphus_riscv64+119763.100.1.1 at 1776728642
[riscv64] MI2a: target SELECTED: libharfbuzz-gobject 14.2.0-alt1:sisyphus_riscv64+119763.100.1.1 at 1776728642
[riscv64] MI2a: requesting to install libharfbuzz-gobject (unspec'd ver; inspect with Debug::pkgMark-shallow)
[riscv64] MI2a: marked for install (shallow): libharfbuzz-gobject
[riscv64] MI2a: satisfying Depends: fontconfig = 2.17.1-alt2:sisyphus_riscv64+93955.100.1.1
[riscv64] MI2a: maybe install (a direct target): fontconfig 2.17.1-alt2:sisyphus_riscv64+93955.100.1.1 at 1756945910
[riscv64] MI2a: target SELECTED: fontconfig 2.17.1-alt2:sisyphus_riscv64+93955.100.1.1 at 1756945910
[riscv64] MI2a: requesting to install fontconfig (unspec'd ver; inspect with Debug::pkgMark-shallow)
[riscv64] MI2a: marked for install (shallow): fontconfig
[riscv64] MI2a: satisfying Depends: libX11-devel (NULL)
[riscv64] MI2a: maybe install (a direct target): libX11-devel 3:1.8.13-alt1:sisyphus_riscv64+110010.100.1.1 at 1770694923
[riscv64] MI2a: target SELECTED: libX11-devel 3:1.8.13-alt1:sisyphus_riscv64+110010.100.1.1 at 1770694923
[riscv64] MI2a: requesting to install libX11-devel (unspec'd ver; inspect with Debug::pkgMark-shallow)
[riscv64] MI2a: marked for install (shallow): libX11-devel
[riscv64] MI2a: satisfying Depends: libxcb-devel (NULL)
[riscv64] MI2a: maybe install (a direct target): libxcb-devel 1.17.0-alt1:sisyphus_riscv64+47651.200.1.1 at 1713376021
[riscv64] MI2a: target SELECTED: libxcb-devel 1.17.0-alt1:sisyphus_riscv64+47651.200.1.1 at 1713376021
[riscv64] MI2a: requesting to install libxcb-devel (unspec'd ver; inspect with Debug::pkgMark-shallow)
[riscv64] MI2a: marked for install (shallow): libxcb-devel
[riscv64] MI2a: satisfying Depends: pkgconfig(kbproto) (NULL)
[riscv64] MI2a: maybe install (a providing target): xorg-proto-devel 2025.1-alt1:sisyphus_riscv64+107259.100.1.1 at 1768840357
[riscv64] MI2a: target SELECTED: xorg-proto-devel 2025.1-alt1:sisyphus_riscv64+107259.100.1.1 at 1768840357
[riscv64] MI2a: requesting to install xorg-proto-devel (unspec'd ver; inspect with Debug::pkgMark-shallow)
[riscv64] MI2a: marked for install (shallow): xorg-proto-devel
[riscv64] MI2a: satisfying Depends: libXrender-devel (NULL)
[riscv64] MI2a: maybe install (a direct target): libXrender-devel 0.9.12-alt1:sisyphus_riscv64+71951.100.1.1 at 1738665677
[riscv64] MI2a: target SELECTED: libXrender-devel 0.9.12-alt1:sisyphus_riscv64+71951.100.1.1 at 1738665677
[riscv64] MI2a: requesting to install libXrender-devel (unspec'd ver; inspect with Debug::pkgMark-shallow)
[riscv64] MI2a: marked for install (shallow): libXrender-devel
[riscv64] MI2a: satisfying Depends: pkgconfig(libpng) >= 1.4.0
[riscv64] MI2a: maybe install (a providing target): libpng-devel 1.6.56-alt2:sisyphus_riscv64+116624.100.1.1 at 1774644819
[riscv64] MI2a: target SELECTED: libpng-devel 1.6.56-alt2:sisyphus_riscv64+116624.100.1.1 at 1774644819
[riscv64] MI2a: requesting to install libpng-devel (unspec'd ver; inspect with Debug::pkgMark-shallow)
[riscv64] MI2a: marked for install (shallow): libpng-devel
[riscv64] MI2a: satisfying Depends: pkgconfig(xext) (NULL)
[riscv64] MI2a: maybe install (a providing target): libXext-devel 1.3.6-alt1:sisyphus_riscv64+46670.1100.1.1 at 1711473737
[riscv64] MI2a: target SELECTED: libXext-devel 1.3.6-alt1:sisyphus_riscv64+46670.1100.1.1 at 1711473737
[riscv64] MI2a: requesting to install libXext-devel (unspec'd ver; inspect with Debug::pkgMark-shallow)
[riscv64] MI2a: marked for install (shallow): libXext-devel
[riscv64] MI2a: satisfying Depends: libXau-devel (NULL)
[riscv64] MI2a: maybe install (a direct target): libXau-devel 1.0.11-alt1:sisyphus_riscv64+26806.100.1.1 at 1670595777
[riscv64] MI2a: target SELECTED: libXau-devel 1.0.11-alt1:sisyphus_riscv64+26806.100.1.1 at 1670595777
[riscv64] MI2a: requesting to install libXau-devel (unspec'd ver; inspect with Debug::pkgMark-shallow)
[riscv64] MI2a: marked for install (shallow): libXau-devel
[riscv64] MI2a: satisfying Depends: pkgconfig(zlib) (NULL)
[riscv64] MI2a: maybe install (a providing target): zlib-devel 1.3.1-alt1:sisyphus_riscv64+45939.100.1.1 at 1710445788
[riscv64] MI2a: target SELECTED: zlib-devel 1.3.1-alt1:sisyphus_riscv64+45939.100.1.1 at 1710445788
[riscv64] MI2a: requesting to install zlib-devel (unspec'd ver; inspect with Debug::pkgMark-shallow)
[riscv64] MI2a: marked for install (shallow): zlib-devel
[riscv64] MI2a: marked for install (shallow): libgdk-pixbuf-devel
[riscv64] MI2a: satisfying Depends: libgio-devel (NULL)
[riscv64] MI2a: maybe install (a direct target): libgio-devel 2.88.0-alt1:sisyphus_riscv64+115074.100.1.1 at 1773735024
[riscv64] MI2a: target SELECTED: libgio-devel 2.88.0-alt1:sisyphus_riscv64+115074.100.1.1 at 1773735024
[riscv64] MI2a: requesting to install libgio-devel (unspec'd ver; inspect with Debug::pkgMark-shallow)
[riscv64] MI2a: marked for install (shallow): libgio-devel
[riscv64] MI2a: satisfying Depends: libgdk-pixbuf = 2.44.4-alt1:sisyphus_riscv64+98328.100.1.1
[riscv64] MI2a: maybe install (a direct target): libgdk-pixbuf 2.44.4-alt1:sisyphus_riscv64+98328.100.1.1 at 1761510614
[riscv64] MI2a: target SELECTED: libgdk-pixbuf 2.44.4-alt1:sisyphus_riscv64+98328.100.1.1 at 1761510614
[riscv64] MI2a: requesting to install libgdk-pixbuf (unspec'd ver; inspect with Debug::pkgMark-shallow)
[riscv64] MI2a: marked for install (shallow): libgdk-pixbuf
[riscv64] MI2a: satisfying Depends: libjpeg.so.62()(64bit) >= set:kfZudmJ8ug3LI26to2gWBfpA0s5ksPbYb3V06uZ2gxP4O5llSUjinj
[riscv64] MI2a: maybe install (a providing target): libjpeg 2:3.1.4.1-alt1:sisyphus_riscv64+117065.100.1.1 at 1774912965
[riscv64] MI2a: target SELECTED: libjpeg 2:3.1.4.1-alt1:sisyphus_riscv64+117065.100.1.1 at 1774912965
[riscv64] MI2a: requesting to install libjpeg (unspec'd ver; inspect with Debug::pkgMark-shallow)
[riscv64] MI2a: marked for install (shallow): libjpeg
[riscv64] MI2a: satisfying Depends: libtiff.so.6()(64bit) >= set:lhs2h9FXqsVhAiJAXHU6zTpvrzLhXJO
[riscv64] MI2a: maybe install (a providing target): libtiff6 4.7.1-alt1:sisyphus_riscv64+95658.100.1.1 at 1758293667
[riscv64] MI2a: target SELECTED: libtiff6 4.7.1-alt1:sisyphus_riscv64+95658.100.1.1 at 1758293667
[riscv64] MI2a: requesting to install libtiff6 (unspec'd ver; inspect with Debug::pkgMark-shallow)
[riscv64] MI2a: marked for install (shallow): libtiff6
[riscv64] MI2a: satisfying Depends: libdeflate.so.0()(64bit) >= set:ifCEnhV7c75unfGi0p
[riscv64] MI2a: maybe install (a providing target): libdeflate 1.25-alt1:sisyphus_riscv64+99584.100.1.1 at 1762106009
[riscv64] MI2a: target SELECTED: libdeflate 1.25-alt1:sisyphus_riscv64+99584.100.1.1 at 1762106009
[riscv64] MI2a: requesting to install libdeflate (unspec'd ver; inspect with Debug::pkgMark-shallow)
[riscv64] MI2a: marked for install (shallow): libdeflate
[riscv64] MI2a: satisfying Depends: libwebp.so.7()(64bit) >= set:kfeybVebvbq98FOogoMMZc91uql30oRiYPt56YEea
[riscv64] MI2a: maybe install (a providing target): libwebp7 1.6.0-alt1.1:sisyphus_riscv64+91429.100.1.1 at 1754536805
[riscv64] MI2a: target SELECTED: libwebp7 1.6.0-alt1.1:sisyphus_riscv64+91429.100.1.1 at 1754536805
[riscv64] MI2a: requesting to install libwebp7 (unspec'd ver; inspect with Debug::pkgMark-shallow)
[riscv64] MI2a: marked for install (shallow): libwebp7
[riscv64] MI2a: satisfying Depends: libgdk-pixbuf-locales = 2.44.4-alt1:sisyphus_riscv64+98328.100.1.1
[riscv64] MI2a: maybe install (a direct target): libgdk-pixbuf-locales 2.44.4-alt1:sisyphus_riscv64+98328.100.1.1 at 1761510614
[riscv64] MI2a: target SELECTED: libgdk-pixbuf-locales 2.44.4-alt1:sisyphus_riscv64+98328.100.1.1 at 1761510614
[riscv64] MI2a: requesting to install libgdk-pixbuf-locales (unspec'd ver; inspect with Debug::pkgMark-shallow)
[riscv64] MI2a: marked for install (shallow): libgdk-pixbuf-locales
[riscv64] rpm-macros-meson is already the newest version.
[riscv64] Selecting libwayland-client-devel for 'pkgconfig(wayland-client)'
[riscv64] Selecting libwayland-cursor-devel for 'pkgconfig(wayland-cursor)'
[riscv64] Selecting wayland-protocols for 'pkgconfig(wayland-protocols)'
[riscv64] Selecting libxkbcommon-devel for 'pkgconfig(xkbcommon)'
[riscv64] Selecting libcairo-devel for 'pkgconfig(cairo)'
[riscv64] Selecting scdoc for 'pkgconfig(scdoc)'
[riscv64] Selecting libgdk-pixbuf-devel for 'pkgconfig(gdk-pixbuf-2.0)'
[riscv64] E: Couldn't find package libgomp15-devel
[riscv64] hsh-install: Failed to calculate package file list.
[riscv64] hsh-install: Failed to generate package file list.
2026-May-07 10:42:00 :: [riscv64] waylogout-0.3-alt2.src.rpm: remote: cannot build src.rpm
2026-May-07 10:42:00 :: [riscv64] #700 waylogout-0.3-alt2.src.rpm: build FAILED
2026-May-07 10:42:00 :: [riscv64] requesting cancellation of task processing
2026-May-07 10:42:00 :: [riscv64] build FAILED
2026-May-07 10:42:00 :: task #120273 for sisyphus_riscv64 FAILED
More information about the Riscv-reports
mailing list