[riscv-reports] [#120255] sisyphus_riscv64 FAILED srpm=smile-2.12.3-alt1.src.rpm srpm=pipeline-4.0.0-alt1.src.rpm
Girar sisyphus_riscv64 awaiter recycler
noreply at basealt.ru
Thu May 7 11:57:47 MSK 2026
http://web.build.srt.basealt.ru/tasks/120255/logs/events.1.1.log
subtask name riscv64
#100 smile 4:09
#200 pipeline failed
2026-May-07 08:45:04 :: shared task #120255 for sisyphus_riscv64 started by recycler:
2026-May-07 08:45:04 :: message: sync
#100 build smile-2.12.3-alt1.src.rpm
#200 build pipeline-4.0.0-alt1.src.rpm
2026-May-07 08:45:05 :: created build repo
2026-May-07 08:45:07 :: [riscv64] #100 smile-2.12.3-alt1.src.rpm: build start
2026-May-07 08:49:16 :: [riscv64] #100 smile-2.12.3-alt1.src.rpm: build OK
2026-May-07 08:49:16 :: [riscv64] #200 pipeline-4.0.0-alt1.src.rpm: build start
[riscv64] Compiling env_filter v0.1.4
[riscv64] error: couldn't read `/usr/src/RPM/BUILD/pipeline-4.0.0/vendor/rquickjs-sys/src/bindings/riscv64gc-unknown-linux-gnu.rs`: No such file or directory (os error 2)
[riscv64] --> /usr/src/RPM/BUILD/pipeline-4.0.0/vendor/rquickjs-sys/src/lib.rs:17:1
[riscv64] --
[riscv64] warning: rquickjs-sys at 0.9.0: rquickjs probably doesn't ship bindings for platform `riscv64gc-unknown-linux-gnu(n/a)`. try the `bindgen` feature instead.
[riscv64] error: could not compile `rquickjs-sys` (lib) due to 1 previous error
[riscv64] warning: build failed, waiting for other jobs to finish...
[riscv64] FAILED: [code=101] src/tubefeeder
[riscv64] /usr/bin/env CARGO_HOME=/usr/src/RPM/BUILD/pipeline-4.0.0/riscv64-alt-linux/cargo-home /usr/bin/cargo build --manifest-path /usr/src/RPM/BUILD/pipeline-4.0.0/Cargo.toml --target-dir /usr/src/RPM/BUILD/pipeline-4.0.0/riscv64-alt-linux/target --release && cp target/release/tubefeeder src/tubefeeder
2026-May-07 08:57:47 :: [riscv64] pipeline-4.0.0-alt1.src.rpm: remote: build failed
2026-May-07 08:57:47 :: [riscv64] #200 pipeline-4.0.0-alt1.src.rpm: build FAILED
2026-May-07 08:57:47 :: [riscv64] requesting cancellation of task processing
2026-May-07 08:57:47 :: [riscv64] build FAILED
2026-May-07 08:57:47 :: task #120255 for sisyphus_riscv64 FAILED
More information about the Riscv-reports
mailing list