[riscv-reports] [#120127] sisyphus_riscv64 FAILED (try 2) srpm=installed-db-office-server-1.5.5-alt1.src.rpm ...

Girar sisyphus_riscv64 awaiter recycler noreply at basealt.ru
Thu May 7 09:15:15 MSK 2026


http://web.build.srt.basealt.ru/tasks/120127/logs/events.2.1.log

2026-May-07 06:13:51 :: shared task #120127 for sisyphus_riscv64 resumed by recycler:
2026-May-07 06:13:51 :: message: sync
#100 removed
#200 build installed-db-office-server-1.5.5-alt1.src.rpm
#300 build task-edu-1.7.15-alt2.src.rpm
#400 build moodle-5.1.3-alt1.src.rpm
2026-May-07 06:13:51 :: created build repo
2026-May-07 06:14:00 :: [riscv64] #200 installed-db-office-server-1.5.5-alt1.src.rpm: build start
2026-May-07 06:14:03 :: [riscv64] #200 installed-db-office-server-1.5.5-alt1.src.rpm: build swiftly SKIPPED
2026-May-07 06:14:03 :: [riscv64] #300 task-edu-1.7.15-alt2.src.rpm: build start
2026-May-07 06:14:05 :: [riscv64] #300 task-edu-1.7.15-alt2.src.rpm: build swiftly SKIPPED
2026-May-07 06:14:05 :: [riscv64] #400 moodle-5.1.3-alt1.src.rpm: build start
2026-May-07 06:14:11 :: [riscv64] #400 moodle-5.1.3-alt1.src.rpm: build swiftly SKIPPED
2026-May-07 06:14:11 :: 200: build check OK (cached)
2026-May-07 06:14:11 :: 300: build check OK (cached)
2026-May-07 06:14:11 :: 400: build check OK (cached)
2026-May-07 06:14:11 :: build check OK
2026-May-07 06:14:12 :: #200: installed-db-office-server-1.5.5-alt1.src.rpm: package `installed-db-office-server' version `1.5.5-alt1' was built earlier for sisyphus_riscv64 from a different source: `srpm:5c40166c8fc044b693d4e2b57b1e34d0cf9f9086'
2026-May-07 06:14:12 :: source id check COND-OK
2026-May-07 06:14:12 :: #200: installed-db-office-server-1.5.5-alt1.src.rpm: version check OK
2026-May-07 06:14:12 :: #300: task-edu-1.7.15-alt2.src.rpm: version check OK
2026-May-07 06:14:12 :: #400: moodle-5.1.3-alt1.src.rpm: package `moodle' version `5.1.3-alt1' was built earlier for sisyphus_riscv64 from a different source: `srpm:4739f5b9bf1e5a7750102d7b9574dd2929d314fd'
2026-May-07 06:14:12 :: source id check COND-OK
2026-May-07 06:14:12 :: #400: moodle-5.1.3-alt1.src.rpm: version check OK
2026-May-07 06:14:12 :: build version check OK
2026-May-07 06:14:13 :: noarch check OK
2026-May-07 06:14:13 :: plan: src +3 -2 =20869, noarch +8 -8 =21664, riscv64 +12 -0 =36923
2026-May-07 06:14:38 :: patched apt indices
2026-May-07 06:14:41 :: created next repo
2026-May-07 06:14:50 :: duplicate provides check OK
	riscv64: NEW unmet dependencies detected:
 task-edu-lite#1.7.15-alt2:sisyphus_riscv64+120127.300.1.1 at 1778132625                  calibre
 task-edu-lite#1.7.15-alt2:sisyphus_riscv64+120127.300.1.1 at 1778132625                  goldendict-ng
 task-edu-lite#1.7.15-alt2:sisyphus_riscv64+120127.300.1.1 at 1778132625                  netpolice-main
 task-edu-secondary-vocational#1.7.15-alt2:sisyphus_riscv64+120127.300.1.1 at 1778132625  qt-creator
 task-edu-secondary-vocational#1.7.15-alt2:sisyphus_riscv64+120127.300.1.1 at 1778132625  qt-creator-doc
 task-edu-university#1.7.15-alt2:sisyphus_riscv64+120127.300.1.1 at 1778132625            qt-creator
 task-edu-university#1.7.15-alt2:sisyphus_riscv64+120127.300.1.1 at 1778132625            qt-creator-doc
	ACLs of affected packages (1):
 task-edu
2026-May-07 06:15:15 :: unmets: riscv64 +7 -0 =7
2026-May-07 06:15:15 :: dependencies check FAILED
2026-May-07 06:15:15 :: task #120127 for sisyphus_riscv64 FAILED


More information about the Riscv-reports mailing list