[riscv-reports] [#119952] sisyphus_riscv64 FAILED srpm=gz-sim-10.1.1-alt1.src.rpm
Girar sisyphus_riscv64 awaiter recycler
noreply at basealt.ru
Wed May 6 23:45:01 MSK 2026
http://web.build.srt.basealt.ru/tasks/119952/logs/events.1.1.log
2026-May-06 20:43:23 :: shared task #119952 for sisyphus_riscv64 started by recycler:
2026-May-06 20:43:23 :: message: sync
#100 build gz-sim-10.1.1-alt1.src.rpm
2026-May-06 20:43:36 :: [riscv64] #100 gz-sim-10.1.1-alt1.src.rpm: build start
2026-May-06 20:45:00 :: [riscv64] #100 gz-sim-10.1.1-alt1.src.rpm: build SKIPPED
2026-May-06 20:45:01 :: #100: gz-sim-10.1.1-alt1.src.rpm: no source package
2026-May-06 20:45:01 :: build check FAILED for: #100
2026-May-06 20:45:01 :: task #119952 for sisyphus_riscv64 FAILED
More information about the Riscv-reports
mailing list