[riscv-reports] [#130930] sisyphus_riscv64 FAILED srpm=opennebula-swap-6.10.5-alt1.src.rpm

Girar sisyphus_riscv64 awaiter recycler noreply at basealt.ru
Tue Jun 30 16:32:31 MSK 2026


http://web.build.srt.basealt.ru/tasks/130930/logs/events.1.1.log

subtask  name             riscv64
   #100  opennebula-swap     1:31

2026-Jun-30 13:29:50 :: shared task #130930 for sisyphus_riscv64 started by recycler:
2026-Jun-30 13:29:50 :: message: sync
#100 build opennebula-swap-6.10.5-alt1.src.rpm
2026-Jun-30 13:29:56 :: [riscv64] #100 opennebula-swap-6.10.5-alt1.src.rpm: build start
2026-Jun-30 13:31:27 :: [riscv64] #100 opennebula-swap-6.10.5-alt1.src.rpm: build OK
2026-Jun-30 13:31:28 :: 100: build check OK
2026-Jun-30 13:31:28 :: build check OK
2026-Jun-30 13:31:28 :: #100: opennebula-swap-6.10.5-alt1.src.rpm: version check OK
2026-Jun-30 13:31:28 :: build version check OK
2026-Jun-30 13:31:28 :: noarch check OK
2026-Jun-30 13:31:29 :: plan: src +1 -0 =21185, riscv64 +2 -0 =37504
2026-Jun-30 13:31:53 :: patched apt indices
2026-Jun-30 13:31:56 :: created next repo
2026-Jun-30 13:32:06 :: duplicate provides check OK
	riscv64: NEW unmet dependencies detected:
 opennebula-swap#6.10.5-alt1:sisyphus_riscv64+130930.100.1.1 at 1782826282  gem-opennebula-cli
	ACLs of affected packages (1):
 opennebula-swap
2026-Jun-30 13:32:30 :: unmets: riscv64 +1 -0 =1
2026-Jun-30 13:32:30 :: dependencies check FAILED
2026-Jun-30 13:32:30 :: task #130930 for sisyphus_riscv64 FAILED


More information about the Riscv-reports mailing list