[riscv-reports] [#130868] sisyphus_riscv64 FAILED srpm=skim-4.10.0-alt1.src.rpm
Girar sisyphus_riscv64 awaiter recycler
noreply at basealt.ru
Tue Jun 30 09:37:02 MSK 2026
http://web.build.srt.basealt.ru/tasks/130868/logs/events.1.1.log
2026-Jun-30 06:35:22 :: shared task #130868 for sisyphus_riscv64 started by recycler:
2026-Jun-30 06:35:22 :: message: sync
#100 build skim-4.10.0-alt1.src.rpm
2026-Jun-30 06:35:29 :: [riscv64] #100 skim-4.10.0-alt1.src.rpm: build start
2026-Jun-30 06:37:01 :: [riscv64] #100 skim-4.10.0-alt1.src.rpm: build SKIPPED
2026-Jun-30 06:37:02 :: #100: skim-4.10.0-alt1.src.rpm: no source package
2026-Jun-30 06:37:02 :: build check FAILED for: #100
2026-Jun-30 06:37:02 :: task #130868 for sisyphus_riscv64 FAILED
More information about the Riscv-reports
mailing list