[riscv-reports] [#130809] sisyphus_riscv64 FAILED srpm=opensearch-3.6.0-alt4.src.rpm
Girar sisyphus_riscv64 awaiter recycler
noreply at basealt.ru
Tue Jun 30 00:04:20 MSK 2026
http://web.build.srt.basealt.ru/tasks/130809/logs/events.1.1.log
2026-Jun-29 21:02:01 :: shared task #130809 for sisyphus_riscv64 started by recycler:
2026-Jun-29 21:02:01 :: message: sync
#100 build opensearch-3.6.0-alt4.src.rpm
2026-Jun-29 21:02:09 :: [riscv64] #100 opensearch-3.6.0-alt4.src.rpm: build start
2026-Jun-29 21:04:18 :: [riscv64] #100 opensearch-3.6.0-alt4.src.rpm: build SKIPPED
2026-Jun-29 21:04:20 :: #100: opensearch-3.6.0-alt4.src.rpm: no source package
2026-Jun-29 21:04:20 :: build check FAILED for: #100
2026-Jun-29 21:04:20 :: task #130809 for sisyphus_riscv64 FAILED
More information about the Riscv-reports
mailing list