[riscv-reports] [#130585] sisyphus_riscv64 FAILED srpm=OrbbecSDK_v2-2.8.7-alt1.src.rpm

Girar sisyphus_riscv64 awaiter recycler noreply at basealt.ru
Sun Jun 28 13:55:38 MSK 2026


http://web.build.srt.basealt.ru/tasks/130585/logs/events.1.1.log

subtask  name          riscv64
   #100  OrbbecSDK_v2   failed

2026-Jun-28 10:52:39 :: shared task #130585 for sisyphus_riscv64 started by recycler:
2026-Jun-28 10:52:39 :: message: sync
#100 build OrbbecSDK_v2-2.8.7-alt1.src.rpm
2026-Jun-28 10:52:44 :: [riscv64] #100 OrbbecSDK_v2-2.8.7-alt1.src.rpm: build start
[riscv64] symbol lookup cache used 5388/65536 hits=21582 misses=5388
[riscv64] finished...
[riscv64] gmake[2]: Leaving directory '/usr/src/RPM/BUILD/OrbbecSDK_v2-2.8.7/riscv64-alt-linux'
[riscv64] gmake[1]: Entering directory '/usr/src/RPM/BUILD/OrbbecSDK_v2-2.8.7/riscv64-alt-linux'
[riscv64] [ 12%] Built target api_reference_en
[riscv64] gmake[1]: Leaving directory '/usr/src/RPM/BUILD/OrbbecSDK_v2-2.8.7/riscv64-alt-linux'
[riscv64] gmake: *** [Makefile:156: all] Error 2
[riscv64] error: Bad exit status from /usr/src/tmp/rpmb-tmp.rrrDgZ (%build)
[riscv64] RPM build errors:
[riscv64]     Bad exit status from /usr/src/tmp/rpmb-tmp.rrrDgZ (%build)
2026-Jun-28 10:55:37 :: [riscv64] OrbbecSDK_v2-2.8.7-alt1.src.rpm: remote: build failed
2026-Jun-28 10:55:37 :: [riscv64] #100 OrbbecSDK_v2-2.8.7-alt1.src.rpm: build FAILED
2026-Jun-28 10:55:37 :: [riscv64] requesting cancellation of task processing
2026-Jun-28 10:55:38 :: [riscv64] build FAILED
2026-Jun-28 10:55:38 :: task #130585 for sisyphus_riscv64 FAILED


More information about the Riscv-reports mailing list